ethnologie
created: 2013-07-05T11:27:24+02:00
modified: 2013-07-05T00:00:00+02:00
status: 1
type: Concept
broader: T51-127
definition: Science qui, partant des phénomènes observés par l'ethnographie, les analyse, les classe, en fait la comparaison systématique et cherche à en fournir une théorie synthétique et explicative. (Acad.fr) Etude descriptive des activités d'un groupe humain déterminé : techniques matérielles, organisation sociale, croyances religieuses, mode de transmission des instruments de travail, d'exploitation du sol, structures de la parenté. (Larousse)
in scheme: T51
scope note: Cette notion n'est à utiliser que dans le contexte d'un musée polyvalent.