numismatique
created: 2013-07-05T11:27:24+02:00
modified: 2013-07-05T00:00:00+02:00
status: 1
type: Concept
broader: T51-127
definition: Qui se rapporte aux monnaies et médailles et à leur étude. Science des monnaies et des médailles. (Acad. fr.)
in scheme: T51
scope note: Seules les médailles commémorant un événement ou la fondation d'un monument, non remises à une personne en particulier, relèvent de la numismatique. Ne pas confondre avec phaléristique.