sigillographie
created: 2013-07-05T11:27:24+02:00
modified: 2013-07-05T00:00:00+02:00
status: 1
type: Concept
broader: T51-127
definition: Etude scientifique des sceaux (cachets officiels) et spécialement des sceaux de chartes médiévales. (Robert)
in scheme: T51