anthropologie
created: 2013-07-05T11:27:24+02:00
modified: 2013-07-05T00:00:00+02:00
status: 1
type: Concept
broader: T51-127
definition: Etude des traits distinctifs qui caractérisent les populations humaines. Discipline qui élabore les données de l'ethnographie et de l'ethnologie pour contribuer à une connaissance générale de l'homme. (Acad. fr)
in scheme: T51