broderie
created: 2013-07-05T11:27:24+02:00
modified: 2013-07-05T00:00:00+02:00
status: 1
type: Concept
broader: T51-34
definition: Industrie ou commerce des tissus brodés (ouvrages exécutés à l'aiguille ou à la machine, sur une étoffe ou un canevas, de dessins et de motifs ornementaux). (Acad. fr) Par extension, objets ainsi fabriqués.
in scheme: T51