philatélie
created: 2013-07-05T11:27:24+02:00
modified: 2013-07-05T00:00:00+02:00
status: 1
type: Concept
broader: T51-127
definition: Etude, recherche, collection de timbres-poste. (CNRTL) Science, recherche, étude des timbres-poste et, éventuellement d'objets connexes, comme les marques d'affranchissement. C'est vers 1849 que la philatélie alors appelée "timbromanie", a pris naissance en France. (Larousse)
in scheme: T51