émaillerie
created: 2013-07-05T11:27:24+02:00
modified: 2013-07-05T00:00:00+02:00
status: 1
type: Concept
broader: T51-12
definition: Art de fabriquer des émaux, de décorer à l'émail. (Acad.fr) Email : matière incolore, transparente ou opaque, obtenue par la vitrification de divers minéraux, qui peut être colorée par des oxydes métalliques et qu'on applique par fusion sur certains ouvrages de métal, de terre cuite, de verre, pour les orner. (Acad.fr) Par extension, objets ainsi fabriqués.
in scheme: T51