sellerie
created: 2013-07-05T11:27:24+02:00
modified: 2013-07-05T00:00:00+02:00
status: 1
type: Concept
broader: T51-12
definition: Métier, commerce et ouvrages du sellier (selles, harnais, coussins et garniture pour voitures). (Robert)
in scheme: T51
scope note: Doubler éventuellement avec transports – communication ou jeux – sports – loisirs ou éperonnerie.