art mobilier
created: 2013-07-05T11:27:24+02:00
modified: 2013-07-05T00:00:00+02:00
status: 1
type: Concept
broader: T51-1
definition: L'art mobilier est une forme d'art préhistorique consistant en la décoration de petits objets facilement transportables (à la différence de l'art pariétal) dont le support est minéral ou organique (os, bois de renne, ivoire). [D'après Baffier, Lantier, Leroi-Gourhan]
in scheme: T51
scope note: Concerne exclusivement l'archéologie. Ce terme s'applique à tout objet (outils, armes…) portant un décor abondant ou non, aux objets à suspendre (éléments de parure, rondelles, contours découpés), aux statuettes et aux plaquettes gravées. [D'après Lantier, Leroi-Gourhan, Baffier] Cf art pariétal, industrie lithique, industrie osseuse.