tapisserie
created: 2013-07-05T11:27:24+02:00
modified: 2013-07-05T00:00:00+02:00
status: 1
type: Concept
broader: T51-12
definition: Ouvrage d'art en tissu, effectué au métier, dans lequel le dessin résulte de l'armure même et qui est destiné à former des panneaux verticaux ; un de ces panneaux. Par extension, art de ces ouvrages ; ces ouvrages. (Robert)
in scheme: T51