vannerie
created: 2013-07-05T11:27:24+02:00
modified: 2013-07-05T00:00:00+02:00
status: 1
type: Concept
broader: T51-12
definition: Métier de vannier, industrie qui fabrique des objets tressés avec des fibres végétales, des tiges. Par extension, objets ainsi fabriqués. (Robert)
in scheme: T51