vitrail
created: 2013-07-05T11:27:24+02:00
modified: 2013-07-05T00:00:00+02:00
status: 1
type: Concept
broader: T51-12
definition: Technique de fabrication des vitraux (panneau constitué de morceaux de verre, généralement colorés, assemblés pour former une décoration. (Robert)
in scheme: T51