oeuvre en 3 dimensions
created: 2013-07-05T11:27:24+02:00
modified: 2013-07-05T00:00:00+02:00
status: 1
type: Concept
broader: T51-1
in scheme: T51
scope note: Concerne l'art contemporain ; installation