peinture
created: 2013-07-05T11:27:24+02:00
modified: 2013-07-05T00:00:00+02:00
status: 1
type: Concept
broader: T51-1
definition: Inclut fresque, peintures acrylique, à l'huile, à la colle, à la cire, sur toile, bois, carton, papier, métal, plastique ou minéral. Inclut également les œuvres extrême-orientales (Chine, Japon…) à l'encre ou aux couleurs légères sur papier.
in scheme: T51