plumasserie
created: 2013-07-05T11:27:24+02:00
modified: 2013-07-05T00:00:00+02:00
status: 1
type: Concept
broader: T51-1
definition: Travail, métier du plumassier qui apprête les plumes, notamment pour leur emploi ornemental, qui fait ou vend des ouvrages en plumes. (Acad.fr)
in scheme: T51