sculpture
created: 2013-07-05T11:27:24+02:00
modified: 2013-07-05T00:00:00+02:00
status: 1
type: Concept
broader: T51-1
definition: Représentation, suggestion d'un objet dans l'espace, au moyen d'une matière à laquelle on impose une forme déterminée, dans un but esthétique ; ensemble des techniques qui permettent cette représentation. Une sculpture, œuvre sculptée. (Robert)
in scheme: T51