enluminure
created: 2013-07-05T11:27:24+02:00
modified: 2013-07-05T00:00:00+02:00
status: 1
type: Concept
broader: T51-1
definition: Décor et illustration d'un manuscrit, généralement à la gouache, mais aussi à l'encre, parfois avec rehauts d'or, sur vélin, parchemin ou papier. Art d'enluminer. Au pluriel. Lettres initiales ornées, arabesques, fleurons, vignettes, scènes figuratives, qui décorent les manuscrits anciens. (Des manuscrits à enluminures. Les enluminures d'un livre d'heures). (Acad.fr)
in scheme: T51
scope note: A ne pas confondre avec miniature.