âge du bronze
created: 2013-07-05T11:27:24+02:00
modified: 2013-07-05T00:00:00+02:00
status: 1
type: Concept
broader: T51-76
definition: Après la Préhistoire, l'âge du bronze est la première période de la "Protohistoire", appelée aussi "âges des métaux". Marqué par d'importantes avancées, tant technologiques que sociales, l'âge du bronze constitue une étape importante de l'évolution des sociétés européennes. Elle se caractérise par l'usage de la métallurgie du bronze, alliage principalement composé de cuivre et d'étain.
in scheme: T51