médiéval
created: 2013-07-05T11:27:24+02:00
modified: 2019-10-25T11:20:53+02:00
status: 1
type: Concept
alternative label: Moyen Age
alternative label: Moyen-Age
alternative label: moyen âge
alternative label: moyen-âge
broader: T51-76
definition: Période médiévale ou ​Moyen-âge : les historiens des textes le font débuter en 476, à la fin du règne de Romulus Augustule, dernier empereur romain d'Occident, ou en 496, date du baptême de Clovis. Il se termine soit en 1453, avec la prise de Constantinople par les Turcs et la fin de l'Empire romain d'Orient, soit en 1492, date de l’accostage de Christophe Colomb sur le continent américain, ou encore à la mort de Louis XI en 1481.
in scheme: T51