mésolithique
created: 2013-07-05T11:27:24+02:00
modified: 2013-07-05T00:00:00+02:00
status: 1
type: Concept
broader: T51-76
definition: Au Mésolithique, les successeurs des hommes du Paléolithique s’adaptent au brusque réchauffement climatique du début de notre actuelle période interglaciaire (vers - 9600). Ils conservent néanmoins un mode de vie basé sur la chasse, la pêche et la cueillette, qui s’achève avec l’arrivée des agriculteurs-éleveurs du Néolithique, autour de - 6000 en France.
in scheme: T51