néolithique
created: 2013-07-05T11:27:24+02:00
modified: 2013-07-05T00:00:00+02:00
status: 1
type: Concept
broader: T51-76
definition: En France, la période néolithique, qui correspond aux premières sociétés de paysans, est comprise entre 6000 et 2200 avant notre ère. Elle est caractérisée par l’abandon du mode de vie nomade, l’utilisation de la céramique pour fabriquer des poteries et le polissage de certains outils en pierre tels que les haches.Mais c’est dans le Croissant Fertile vers 12000 avant notre ère, que l’Homme commence à construire des maisons puis, petit à petit, à domestiquer des espèces végétales (blé, orge) et animales (mouton, chèvre).
in scheme: T51