précolombien
created: 2013-07-05T11:27:24+02:00
modified: 2013-07-05T00:00:00+02:00
status: 1
type: Concept
broader: T51-76
definition: Précolombien : relatif aux civilisations et aux ethnies de l'Amérique, principalement du Pérou et de l'Amérique centrale, qui existaient antérieurement à sa découverte par Christophe Colomb et à sa conquête par les Espagnols.
in scheme: T51