causeEffet
type: ObjectProperty
sub property of: related

actionProduction
type: ObjectProperty
sub property of: related

broaderGeneric
type: ObjectProperty
sub property of: broader
inverse of: narrowerGeneric

narrowerGeneric
type: ObjectProperty
sub property of: narrower
inverse of: broaderGeneric

broaderPartitive
type: ObjectProperty
sub property of: broader
inverse of: narrowerPartitive

narrowerPartitive
type: ObjectProperty
sub property of: narrower
inverse of: broaderPartitive

narrowerInstantive
type: ObjectProperty
sub property of: narrower
inverse of: broaderInstantive

broaderInstantive
type: ObjectProperty
sub property of: broader
inverse of: narrowerInstantive

TermeAssocie
type: ObjectProperty
sub property of: related

CustomConceptAttribute
type: DatatypeProperty

status
type: DatatypeProperty

Liste d'autorités Domaines - Joconde
type: ConceptScheme
creator: Service des musées de France
contributor: Sophie Daënens et Angelina Meslem
publisher: Ministère de la culture et de la communication
description: Vocabulaire contrôlé des domaines dans la base Joconde (DOMN-Joconde)
modified: 2020-12-16T16:44:26+01:00
type: Thésaurus
rights: CC-BY-SA
subject: Attention : en raison d’un bogue, les vocabulaires apparaissent sous une forme appauvrie (absence de majuscules et d’accents).
subject: Toutefois, la forme intègre réapparaît lors du téléchargement.
coverage: Définition et ou usage des termes du champ "Domaine" de la base Joconde, qui recense les collections des musées ayant l'appellation "musée de France"
language: fr-FR
has top concept: domaine par type de fonction
has top concept: domaine par support de conservation
has top concept: domaine disciplinaire
created: 2013-07-05T11:27:24+02:00
issued: Publication
date submitted: 2020-12-17T07:49:27.850+01:00

spectacle - fête
type: Concept
modified: 2013-07-05T00:00:00+02:00
in scheme: Liste d'autorités Domaines - Joconde
broader: domaine par type de fonction
created: 2013-07-05T11:27:24+02:00
scope note: Inclut les notions d'activités festives, manifestations culturelles, vie foraine, spectacle, cirque, théâtre, évènements éphémères, etc.
definition: Spectacle : Représentation théâtrale, cinématographique, chorégraphique ; ce qu'on présente au public au cours d'une même séance. L'ensemble des activités concernant le théâtre, le cinéma, le music-hall, la télévision, etc. (Robert) Fête : Jour consacré à une célébration ; cette célébration elle-même. Jour consacré chaque année à la commémoration d'un évènement historique, à la célébration d'un héros national, etc. Manifestation de liesse, réjouissance, célébration publique ou privée. (Acad.fr)
status: 1

domaine par type de fonction
type: Concept
modified: 2013-07-05T00:00:00+02:00
in scheme: Liste d'autorités Domaines - Joconde
narrower: spectacle - fête
narrower: costume - accessoires du costume
narrower: musique - chant - danse
narrower: vie sociale - culturelle
narrower: vie professionnelle
narrower: commerce - économie - finances
narrower: métrologie - instruments de mesure
narrower: énergie
narrower: jeux - sports - loisirs
narrower: croyances - coutumes
narrower: hygiène - médecine - santé
narrower: environnement
narrower: vie domestique
narrower: vie politique - administrative
narrower: ameublement
narrower: enseignement
narrower: transports - communications
narrower: agriculture - élevage
narrower: chasse - pêche - cueillette
narrower: vie militaire
narrower: artisanat - industrie
narrower: construction
created: 2013-07-05T11:27:24+02:00
status: 1

spectacle - fête
type: PreferredTerm
modified: 2013-07-05T00:00:00+02:00
created: 2013-07-05T11:27:24+02:00
status: 1

tapisserie
type: Concept
modified: 2013-07-05T00:00:00+02:00
in scheme: Liste d'autorités Domaines - Joconde
broader: objet au sens large
created: 2013-07-05T11:27:24+02:00
definition: Ouvrage d'art en tissu, effectué au métier, dans lequel le dessin résulte de l'armure même et qui est destiné à former des panneaux verticaux ; un de ces panneaux. Par extension, art de ces ouvrages ; ces ouvrages. (Robert)
status: 1

objet au sens large
type: Concept
modified: 2013-07-05T00:00:00+02:00
in scheme: Liste d'autorités Domaines - Joconde
narrower: tapisserie
narrower: menuiserie
narrower: mosaïque
narrower: orfèvrerie
narrower: lutherie
narrower: métallurgie
narrower: textile
narrower: sellerie
narrower: glyptique
narrower: armurerie
narrower: céramique
narrower: horlogerie
narrower: vannerie
narrower: chaudronnerie
narrower: verrerie
narrower: émaillerie
narrower: dinanderie
narrower: vitrail
narrower: ferronnerie
narrower: industrie lithique
narrower: ébénisterie
narrower: serrurerie
narrower: industrie osseuse
narrower: tabletterie
narrower: ivoirerie
broader: domaine par support de conservation
created: 2013-07-05T11:27:24+02:00
scope note: Ce terme n'est pas à utiliser
status: 1

tapisserie
type: PreferredTerm
modified: 2013-07-05T00:00:00+02:00
created: 2013-07-05T11:27:24+02:00
status: 1

menuiserie
type: Concept
modified: 2013-07-05T00:00:00+02:00
in scheme: Liste d'autorités Domaines - Joconde
broader: objet au sens large
created: 2013-07-05T11:27:24+02:00
definition: Fabrication artisanale ou industrielle d'ouvrages en bois destinés à l'ameublement ou à l'aménagement des bâtiments. Ensemble des ouvrages exécutés par un menuisier. (Acad. fr) Travail (assemblages) du bois pour la fabrication des meubles et objets servant à l'agencement et la décoration des maisons (opposé à charpente). Ouvrages ainsi fabriqués. (Robert)
status: 1

mosaïque
type: Concept
modified: 2013-07-05T00:00:00+02:00
in scheme: Liste d'autorités Domaines - Joconde
broader: objet au sens large
created: 2013-07-05T11:27:24+02:00
definition: Ouvrage composé de petites pierres, de petits morceaux d'émail, de verre, de bois, etc., de différentes couleurs, assemblés sur un fond de manière à former des figures, des ornements, et liés par un mastic. (Acad. fr) Assemblage décoratif de petites pièces rapportées (pierre, marbre, terre cuite, smalt) retenues par un ciment et dont la combinaison figure un dessin ; art d'exécuter ces assemblages. (Robert)
status: 1

objet au sens large
type: PreferredTerm
modified: 2013-07-05T00:00:00+02:00
created: 2013-07-05T11:27:24+02:00
status: 1

orfèvrerie
type: Concept
modified: 2013-07-05T00:00:00+02:00
in scheme: Liste d'autorités Domaines - Joconde
broader: objet au sens large
created: 2013-07-05T11:27:24+02:00
scope note: A ne pas confondre avec métallurgie ou ferronnerie.
definition: Ouvrage ou ensemble d'ouvrages en métal précieux travaillés par un orfèvre (Acad. fr) Art, métier, commerce de l'orfèvre. Ouvrages de l'orfèvre, destinés à la décoration, à l'exercice du culte (calice, ciboire, ostensoir), au service de la table (argenterie, corbeilles, vases…). (Robert) Art, commerce de l'orfèvre. C'est l'art de mettre en valeur certains métaux réputés précieux, suivant les pays ou les temps. Elle diffère de la bijouterie en ce que celle-ci fabrique surtout des objets destinés à être portés comme ornements, et de la joaillerie, qui consiste dans la mise en valeur de l'or et de l'argent pour la monture et la disposition des pierres précieuses. (Larousse)
status: 1

domaine par support de conservation
type: Concept
modified: 2013-07-05T00:00:00+02:00
in scheme: Liste d'autorités Domaines - Joconde
narrower: objet au sens large
narrower: estampe
narrower: sculpture
narrower: enluminure
narrower: plumasserie
narrower: imprimé
narrower: photographie
narrower: miniature
narrower: peinture
narrower: oeuvre en 3 dimensions
narrower: art mobilier
narrower: art pariétal
narrower: manuscrit
narrower: dessin
created: 2013-07-05T11:27:24+02:00
status: 1

lutherie
type: Concept
modified: 2013-07-05T00:00:00+02:00
in scheme: Liste d'autorités Domaines - Joconde
broader: objet au sens large
created: 2013-07-05T11:27:24+02:00
definition: Atelier, fabrique ou magasin d'instruments de musique à cordes. Ensemble des instruments fabriqués et parfois vendus par le luthier. (Centre national de ressources textuelles et lexicales)
status: 1

métallurgie
type: Concept
modified: 2013-07-05T00:00:00+02:00
in scheme: Liste d'autorités Domaines - Joconde
broader: objet au sens large
created: 2013-07-05T11:27:24+02:00
scope note: Terme réservé à des objets tels que les lingots de fer, scories de fonderie, moules… ou encore les outils et machines servant à la fabrication des métaux. A ne pas confondre avec orfèvrerie ou ferronnerie.
definition: Ensemble des industries et des techniques qui assurent la fabrication des métaux. Travail, mise en œuvre des métaux. (Robert) Du grec metallourgia, de même sens. Art d'extraire les métaux de la terre et de les purifier. La métallurgie n'inclut pas le travail du métal au delà de la purification (traitement des métaux par voie sèche : chaleur, fusion, réduction ; par voie humide : acides ; par voie électrique : électrolyse). (Larousse)
status: 1

textile
type: Concept
modified: 2013-07-05T00:00:00+02:00
in scheme: Liste d'autorités Domaines - Joconde
narrower: oeuvre textile
narrower: dentellerie
narrower: broderie
broader: objet au sens large
created: 2013-07-05T11:27:24+02:00
scope note: Par extension, matériel et outils servant à la fabrication des tissus (quenouille, métier à tisser…) On utilisera également ce terme pour des fragments de vêtements ou d'accessoires non identifiables. (ex : tissu copte) Pour les vêtements, utiliser costume – accessoires du costume
definition: Qui concerne la fabrication des tissus, depuis la préparation de la matière première jusqu'à la vente du produit fini. (Robert)
status: 1

sellerie
type: Concept
modified: 2013-07-05T00:00:00+02:00
in scheme: Liste d'autorités Domaines - Joconde
broader: objet au sens large
created: 2013-07-05T11:27:24+02:00
scope note: Doubler éventuellement avec transports – communication ou jeux – sports – loisirs ou éperonnerie.
definition: Métier, commerce et ouvrages du sellier (selles, harnais, coussins et garniture pour voitures). (Robert)
status: 1

glyptique
type: Concept
modified: 2013-07-05T00:00:00+02:00
in scheme: Liste d'autorités Domaines - Joconde
broader: objet au sens large
created: 2013-07-05T11:27:24+02:00
scope note: Inclut les produits finis. Ex : camées, intailles, sceaux et sceaux-cylindres antiques …
definition: Art de graver les pierres fines (Acad. fr et Robert) ; par extension, art de graver les poinçons et les coins des médailles (Acad.fr)
status: 1

armurerie
type: Concept
modified: 2013-07-05T00:00:00+02:00
in scheme: Liste d'autorités Domaines - Joconde
broader: objet au sens large
created: 2013-07-05T11:27:24+02:00
scope note: Terme réservé aux outils et machines de fabrication des armes. Ce domaine exclut les produits finis pour lesquels il convient d'utiliser vie militaire ou chasse – pêche – cueillette.
definition: Magasin, dépôt, atelier de fabrication et de réparation d’armes. (Acad. fr) Fabrication, commerce d'armes (Robert).
status: 1

céramique
type: Concept
modified: 2013-07-05T00:00:00+02:00
in scheme: Liste d'autorités Domaines - Joconde
broader: objet au sens large
created: 2013-07-05T11:27:24+02:00
definition: Art de fabriquer des objets en terre cuite, faïence, porcelaine, grès, etc. et de les décorer. Par métonymie, matière obtenue par cuisson de la terre. Vase, objet fabriqué en terre cuite (Acad. fr)
status: 1

horlogerie
type: Concept
modified: 2013-07-05T00:00:00+02:00
in scheme: Liste d'autorités Domaines - Joconde
broader: objet au sens large
created: 2013-07-05T11:27:24+02:00
scope note: Penser à doubler avec métrologie – instruments de mesure.
definition: Fabrication et commerce des horloges et, par extension, des pendules, des montres, etc. Par métonymie, l'ensemble des instruments courants de mesure du temps. (Acad. fr)​
status: 1

vannerie
type: Concept
modified: 2013-07-05T00:00:00+02:00
in scheme: Liste d'autorités Domaines - Joconde
broader: objet au sens large
created: 2013-07-05T11:27:24+02:00
definition: Métier de vannier, industrie qui fabrique des objets tressés avec des fibres végétales, des tiges. Par extension, objets ainsi fabriqués. (Robert)
status: 1

chaudronnerie
type: Concept
modified: 2013-07-05T00:00:00+02:00
in scheme: Liste d'autorités Domaines - Joconde
broader: objet au sens large
created: 2013-07-05T11:27:24+02:00
definition: Fabrication, commerce de chaudrons, de marmites et d'autres ustensiles de cuisine en fer, en cuivre, etc. Petite chaudronnerie. Par métonymie, l'ensemble de ces ustensiles. Fabrication artisanale ou industrielle de pièces métalliques par emboutissage, martelage, étamage, etc. Usine, atelier de chaudronnerie ou lieu où l'on exerce ces activités. Grosse chaudronnerie, utilisant des tôles épaisses pour fabriquer des chaudières ou d'autres appareils industriels. Par métonymie, ces appareils eux-mêmes. (Acad.fr)
status: 1

verrerie
type: Concept
modified: 2013-07-05T00:00:00+02:00
in scheme: Liste d'autorités Domaines - Joconde
broader: objet au sens large
created: 2013-07-05T11:27:24+02:00
definition: Fabrication du verre et des objets en verre. Objets, ouvrages de verre. (Robert)
status: 1

émaillerie
type: Concept
modified: 2013-07-05T00:00:00+02:00
in scheme: Liste d'autorités Domaines - Joconde
broader: objet au sens large
created: 2013-07-05T11:27:24+02:00
definition: Art de fabriquer des émaux, de décorer à l'émail. (Acad.fr) Email : matière incolore, transparente ou opaque, obtenue par la vitrification de divers minéraux, qui peut être colorée par des oxydes métalliques et qu'on applique par fusion sur certains ouvrages de métal, de terre cuite, de verre, pour les orner. (Acad.fr) Par extension, objets ainsi fabriqués.
status: 1

dinanderie
type: Concept
modified: 2013-07-05T00:00:00+02:00
in scheme: Liste d'autorités Domaines - Joconde
broader: objet au sens large
created: 2013-07-05T11:27:24+02:00
definition: Ensemble des ustensiles de cuivre jaune fabriqués à l'origine dans la ville de Dinant, en Belgique. Art de travailler le cuivre et ses alliages, spécialement par martelage. Usine, atelier où l'on pratique cet art. (Acad.fr)
status: 1

vitrail
type: Concept
modified: 2013-07-05T00:00:00+02:00
in scheme: Liste d'autorités Domaines - Joconde
broader: objet au sens large
created: 2013-07-05T11:27:24+02:00
definition: Technique de fabrication des vitraux (panneau constitué de morceaux de verre, généralement colorés, assemblés pour former une décoration. (Robert)
status: 1

ferronnerie
type: Concept
modified: 2013-07-05T00:00:00+02:00
in scheme: Liste d'autorités Domaines - Joconde
broader: objet au sens large
created: 2013-07-05T11:27:24+02:00
scope note: A ne pas confondre avec métallurgie ou orfèvrerie.
definition: Ouvrage en fer travaillé. Lieu où l'on fabrique, où l'on vend des ouvrages de fer, le plus souvent artistement travaillés. (Acad.fr) Par extension, matériel et outils servant à ce travail.
status: 1

industrie lithique
type: Concept
modified: 2013-07-05T00:00:00+02:00
in scheme: Liste d'autorités Domaines - Joconde
broader: objet au sens large
created: 2013-07-05T11:27:24+02:00
scope note: Concerne exclusivement l'archéologie. Le terme industrie lithique est réservé à l'outillage préhistorique non décoré en pierre ainsi que les objets obtenus à certaines étapes de la taille de la pierre (éclat de débitage, chute de burin, nucléus, etc.) Cf art mobilier.
definition: Industrie : ensemble des techniques et des activités par lesquelles un groupe humain transforme la matière première pour en tirer des objets fabriqués. Par métonymie, collection des objets résultant de ces activités. Dans cet emploi, le terme exclut généralement les objets d'art ; dans la pratique, il désigne les outils, les armes et leurs déchets de fabrication. [Leroi-Gourhan] L'industrie lithique concerne le travail de la pierre.
status: 1

ébénisterie
type: Concept
modified: 2013-07-05T00:00:00+02:00
in scheme: Liste d'autorités Domaines - Joconde
broader: objet au sens large
created: 2013-07-05T11:27:24+02:00
definition: Art, travail, métier de l'ébéniste. Ouvrage d'ébénisterie. Par métonymie, production des ébénistes. Ebéniste : artisan qui travaille l'ébène ou d'autres bois précieux, ou qui produit des ouvrages de marqueterie. (Acad.fr)
status: 1

serrurerie
type: Concept
modified: 2013-07-05T00:00:00+02:00
in scheme: Liste d'autorités Domaines - Joconde
broader: objet au sens large
created: 2013-07-05T11:27:24+02:00
scope note: Inclut les clefs.
definition: Serrure : dispositif fixe de fermeture d'une porte, d'un tiroir, d'un coffre…) comportant un mécanisme qu'on manœuvre à l'aide d'une clé. (Robert)
status: 1

industrie osseuse
type: Concept
modified: 2013-07-05T00:00:00+02:00
in scheme: Liste d'autorités Domaines - Joconde
broader: objet au sens large
created: 2013-07-05T11:27:24+02:00
scope note: Concerne exclusivement l'archéologie. Le terme industrie osseuse est réservé à l'outillage préhistorique non décoré en os, bois de cervidé ou ivoire. Cf art mobilier.
definition: Industrie : ensemble des techniques et des activités par lesquelles un groupe humain transforme la matière première pour en tirer des objets fabriqués. Par métonymie, collection des objets résultant de ces activités. Dans cet emploi, le terme exclut généralement les objets d'art ; dans la pratique, il désigne les outils, les armes et leurs déchets de fabrication. [Leroi-Gourhan] L'industrie osseuse concerne le travail de l'os, du bois de cervidé ou de l'ivoire.
status: 1

tabletterie
type: Concept
modified: 2013-07-05T00:00:00+02:00
in scheme: Liste d'autorités Domaines - Joconde
broader: objet au sens large
created: 2013-07-05T11:27:24+02:00
scope note: Ne pas confondre avec ébénisterie.
definition: Métier, commerce du tabletier qui utilise le placage (comme l'ébénisterie), l'incrustation (comme la marqueterie), la sculpture, etc. Objets de tabletterie : coffrets, étuis, échiquiers, damiers, éventails, peignes, objets pour fumeurs. (Robert)
status: 1

ivoirerie
type: Concept
modified: 2013-07-05T00:00:00+02:00
in scheme: Liste d'autorités Domaines - Joconde
broader: objet au sens large
created: 2013-07-05T11:27:24+02:00
definition: Art de l'ivoirier, industrie et commerce de l'ivoire. (Acad.fr) Par extension, objets ainsi fabriqués.
status: 1

estampe
type: Concept
modified: 2013-07-05T00:00:00+02:00
in scheme: Liste d'autorités Domaines - Joconde
narrower: élément d'impression
broader: domaine par support de conservation
created: 2013-07-05T11:27:24+02:00
definition: Toute réalisation obtenue par quelque élément imprimant que ce soit, pourvu que ce dernier ait été préparé manuellement. L'utilisation d'un moyen mécanique ou photographique peut cependant entrer pour une certaine part dans la réalisation de l'estampe. Image imprimée sur papier au moyen d'une planche gravée, en bois ou en métal, ou d'un support en pierre. (Acad. fr)
status: 1

élément d'impression
type: Concept
modified: 2013-07-05T00:00:00+02:00
in scheme: Liste d'autorités Domaines - Joconde
broader: estampe
created: 2013-07-05T11:27:24+02:00
definition: Plaque, planche, pierre, écran : permet une impression, en relief, en creux, à plat, au pochoir, par encrage.
status: 1

estampe
type: PreferredTerm
modified: 2013-07-05T00:00:00+02:00
created: 2013-07-05T11:27:24+02:00
status: 1

étrusque
type: Concept
modified: 2013-07-05T00:00:00+02:00
in scheme: Liste d'autorités Domaines - Joconde
broader: civilisation
created: 2013-07-05T11:27:24+02:00
definition: Relatif au peuple qui habitait l'Étrurie, contrée de l'Italie ancienne. (Robert)
status: 1

civilisation
type: Concept
modified: 2019-02-07T15:47:52+01:00
in scheme: Liste d'autorités Domaines - Joconde
narrower: étrusque
narrower: ottoman
narrower: égyptien
narrower: copte
narrower: phénicien
narrower: chypriote
narrower: punique
narrower: gaulois
narrower: grec
narrower: romain
narrower: carolingien
narrower: ibérique
narrower: inca
narrower: basque
narrower: gallo-romain
narrower: inuit
narrower: amérindien
narrower: italique
narrower: civilisations de l'Islam
narrower: mérovingien
created: 2013-07-05T11:27:24+02:00
scope note: Ce terme n'est pas à utiliser.
status: 1

étrusque
type: PreferredTerm
modified: 2013-07-05T00:00:00+02:00
created: 2013-07-05T11:27:24+02:00
status: 1

géographie
type: Concept
modified: 2019-02-07T15:50:08+01:00
in scheme: Liste d'autorités Domaines - Joconde
narrower: Amérique
narrower: Asie
narrower: Afrique
narrower: Océanie
created: 2013-07-05T11:27:24+02:00
scope note: Ce terme n'est pas à utiliser.
status: 1

domaine par chronologie/civilisation/géographie
type: PreferredTerm
modified: 2019-02-07T15:46:51+01:00
created: 2013-07-05T11:27:24+02:00
status: 1

chronologie
type: Concept
modified: 2019-02-07T15:48:49+01:00
in scheme: Liste d'autorités Domaines - Joconde
narrower: âge du bronze
narrower: chalcolithique
narrower: paléolithique
narrower: mésolithique
narrower: temps modernes
narrower: néolithique
narrower: médiéval
narrower: précolombien
narrower: moderne
narrower: âge du fer
created: 2013-07-05T11:27:24+02:00
scope note: Ce terme n'est pas à utiliser.
status: 1

nouveaux médias
type: Concept
modified: 2015-04-09T14:32:33+02:00
in scheme: Liste d'autorités Domaines - Joconde
broader: domaine par support de conservation
created: 2015-04-09T14:28:28+02:00
definition: Concerne les vidéos : regroupe l'ensemble des techniques permettant l'enregistrement ainsi que la restitution d'images animées, accompagnées ou non de son, sur un support électronique et non de type photochimique.
status: 1

nouveaux médias
type: PreferredTerm
modified: 2015-04-09T14:32:33+02:00
created: 2015-04-09T14:28:28+02:00
status: 1

Amérique centrale
type: Concept
modified: 2013-07-05T00:00:00+02:00
in scheme: Liste d'autorités Domaines - Joconde
broader: Amérique
created: 2013-07-05T11:27:24+02:00
status: 1

Amérique
type: Concept
modified: 2013-07-05T00:00:00+02:00
in scheme: Liste d'autorités Domaines - Joconde
narrower: Amérique centrale
narrower: Amérique du sud
narrower: Amérique du nord
broader: géographie
created: 2013-07-05T11:27:24+02:00
status: 1

Amérique centrale
type: PreferredTerm
modified: 2013-07-05T00:00:00+02:00
created: 2013-07-05T11:27:24+02:00
status: 1

design
type: Concept
modified: 2015-04-07T16:23:16+02:00
in scheme: Liste d'autorités Domaines - Joconde
broader: domaine disciplinaire
created: 2013-07-05T11:27:24+02:00
scope note: Doubler éventuellement avec mobilier, vie domestique ou architecture.
definition: Esthétique industrielle appliquée à la recherche de formes nouvelles et adaptées à leur fonction – pour les objets utilitaires, les meubles , l'habitat en général. (Robert)
status: 1

domaine disciplinaire
type: Concept
modified: 2013-07-05T00:00:00+02:00
in scheme: Liste d'autorités Domaines - Joconde
narrower: design
narrower: héraldique
narrower: philatélie
narrower: architecture
narrower: cartes - plans
narrower: phaléristique
narrower: éperonnerie
narrower: sciences naturelles
narrower: archéologie
narrower: anthropologie
narrower: arts décoratifs
narrower: sigillographie
narrower: sciences - techniques
narrower: beaux-arts
narrower: numismatique
narrower: histoire
narrower: épigraphie
narrower: ethnologie
created: 2013-07-05T11:27:24+02:00
status: 1

design
type: PreferredTerm
modified: 2015-04-07T16:23:16+02:00
created: 2013-07-05T11:27:24+02:00
status: 1

objet/design
type: Concept
modified: 2015-04-07T16:22:31+02:00
in scheme: Liste d'autorités Domaines - Joconde
broader: design
created: 2015-04-07T16:22:31+02:00
status: 1

costume - accessoires du costume
type: Concept
modified: 2013-07-05T00:00:00+02:00
in scheme: Liste d'autorités Domaines - Joconde
broader: domaine par type de fonction
created: 2013-07-05T11:27:24+02:00
scope note: Inclut les notions d'habillement, de costumes civils, costumes de représentation, uniformes civils, uniformes militaires [pour ces derniers, doubler avec vie militaire], bijoux, objets de parure, chaussures, couvre-chefs, éléments de costumes multifonctionnels, etc.
definition: Costume : Manière de se vêtir conforme à la coutume, à la tradition d'une époque ou d'un pays, à l'usage d'un métier. (Acad.fr) Accessoire : Pièce, instrument, etc., qui, en s'ajoutant à une machine, à un appareil, contribue à son fonctionnement. Par analogie, élément, tel que le sac, le foulard, etc., qui complète une toilette. (Acad.fr)
status: 1

costume - accessoires du costume
type: PreferredTerm
modified: 2013-07-05T00:00:00+02:00
created: 2013-07-05T11:27:24+02:00
status: 1

ottoman
type: Concept
modified: 2013-07-05T00:00:00+02:00
in scheme: Liste d'autorités Domaines - Joconde
broader: civilisation
created: 2013-07-05T11:27:24+02:00
definition: Empire turc constitué par Osman et ses successeurs, qui atteignit son apogée au XVIIes., puis déclina jusqu'à son démembrement après la Première Guerre mondiale et prit fin avec l'établissement de la république en 1923. (Centre national de recherches textuelles et lexicales)
status: 1

ottoman
type: PreferredTerm
modified: 2013-07-05T00:00:00+02:00
created: 2013-07-05T11:27:24+02:00
status: 1

héraldique
type: Concept
modified: 2013-07-05T00:00:00+02:00
in scheme: Liste d'autorités Domaines - Joconde
broader: domaine disciplinaire
created: 2013-07-05T11:27:24+02:00
definition: Science du blason, ensemble des usages et des règles permettant de décrire et de représenter correctement armes et armoiries. (Acad. fr.)
status: 1

héraldique
type: PreferredTerm
modified: 2013-07-05T00:00:00+02:00
created: 2013-07-05T11:27:24+02:00
status: 1

mosaïque
type: PreferredTerm
modified: 2013-07-05T00:00:00+02:00
created: 2013-07-05T11:27:24+02:00
status: 1

Asie méridionale
type: Concept
modified: 2013-07-05T00:00:00+02:00
in scheme: Liste d'autorités Domaines - Joconde
broader: Asie
created: 2013-07-05T11:27:24+02:00
status: 1

Asie
type: Concept
modified: 2013-07-05T00:00:00+02:00
in scheme: Liste d'autorités Domaines - Joconde
narrower: Asie méridionale
narrower: Asie du sud-est
narrower: Asie occidentale
narrower: Asie orientale
narrower: Asie centrale
broader: géographie
created: 2013-07-05T11:27:24+02:00
status: 1

Asie méridionale
type: PreferredTerm
modified: 2013-07-05T00:00:00+02:00
created: 2013-07-05T11:27:24+02:00
status: 1

sculpture
type: Concept
modified: 2013-07-05T00:00:00+02:00
in scheme: Liste d'autorités Domaines - Joconde
broader: domaine par support de conservation
created: 2013-07-05T11:27:24+02:00
definition: Représentation, suggestion d'un objet dans l'espace, au moyen d'une matière à laquelle on impose une forme déterminée, dans un but esthétique ; ensemble des techniques qui permettent cette représentation. Une sculpture, œuvre sculptée. (Robert)
status: 1

sculpture
type: PreferredTerm
modified: 2013-07-05T00:00:00+02:00
created: 2013-07-05T11:27:24+02:00
status: 1

philatélie
type: Concept
modified: 2013-07-05T00:00:00+02:00
in scheme: Liste d'autorités Domaines - Joconde
broader: domaine disciplinaire
created: 2013-07-05T11:27:24+02:00
definition: Etude, recherche, collection de timbres-poste. (CNRTL) Science, recherche, étude des timbres-poste et, éventuellement d'objets connexes, comme les marques d'affranchissement. C'est vers 1849 que la philatélie alors appelée "timbromanie", a pris naissance en France. (Larousse)
status: 1

philatélie
type: PreferredTerm
modified: 2013-07-05T00:00:00+02:00
created: 2013-07-05T11:27:24+02:00
status: 1

musique - chant - danse
type: Concept
modified: 2013-07-05T00:00:00+02:00
in scheme: Liste d'autorités Domaines - Joconde
broader: domaine par type de fonction
created: 2013-07-05T11:27:24+02:00
scope note: Inclut les notions de : Musique / Instrument de musique, etc.
definition: Musique : Art de composer une mélodie selon une harmonie et un rythme ; théorie, science des sons considérés sous le rapport de la mélodie, de l'harmonie, du rythme.Toute production qui relève de cet art (Acad.fr) Art de combiner des sons d'après des règles (variables selon les lieux et les époques), d'organiser une durée avec des éléments sonores ; productions de cet art (sons ou œuvres). (Robert) Chant : suite musicale de sons émis par la voix (Acad.fr) Danse : mouvement du corps et enchaînement de pas exécutés en cadence, ordinairement au son d'instruments de musique ; l'ensemble de ces mouvements, caractérisé par un style ou caractérisant une culture, un pays, une région. (Acad.fr)
status: 1

musique - chant - danse
type: PreferredTerm
modified: 2013-07-05T00:00:00+02:00
created: 2013-07-05T11:27:24+02:00
status: 1

architecture
type: Concept
modified: 2013-07-05T00:00:00+02:00
in scheme: Liste d'autorités Domaines - Joconde
broader: domaine disciplinaire
created: 2013-07-05T11:27:24+02:00
definition: Art de construire, de disposer et d'orner les édifices. (Acad. fr.)
status: 1

architecture
type: PreferredTerm
modified: 2013-07-05T00:00:00+02:00
created: 2013-07-05T11:27:24+02:00
status: 1

enluminure
type: Concept
modified: 2013-07-05T00:00:00+02:00
in scheme: Liste d'autorités Domaines - Joconde
broader: domaine par support de conservation
created: 2013-07-05T11:27:24+02:00
scope note: A ne pas confondre avec miniature.
definition: Décor et illustration d'un manuscrit, généralement à la gouache, mais aussi à l'encre, parfois avec rehauts d'or, sur vélin, parchemin ou papier. Art d'enluminer. Au pluriel. Lettres initiales ornées, arabesques, fleurons, vignettes, scènes figuratives, qui décorent les manuscrits anciens. (Des manuscrits à enluminures. Les enluminures d'un livre d'heures). (Acad.fr)
status: 1

enluminure
type: PreferredTerm
modified: 2013-07-05T00:00:00+02:00
created: 2013-07-05T11:27:24+02:00
status: 1

armurerie
type: PreferredTerm
modified: 2013-07-05T00:00:00+02:00
created: 2013-07-05T11:27:24+02:00
status: 1

vie sociale - culturelle
type: Concept
modified: 2013-07-05T00:00:00+02:00
in scheme: Liste d'autorités Domaines - Joconde
broader: domaine par type de fonction
created: 2013-07-05T11:27:24+02:00
scope note: Inclut les notions de sociabilité, échanges, organisation sociale, cycles de vie, famille , etc.
status: 1

vie sociale - culturelle
type: PreferredTerm
modified: 2013-07-05T00:00:00+02:00
created: 2013-07-05T11:27:24+02:00
status: 1

égyptien
type: Concept
modified: 2013-07-05T00:00:00+02:00
in scheme: Liste d'autorités Domaines - Joconde
broader: civilisation
alternative label: égypte
created: 2013-07-05T11:27:24+02:00
definition: L'Égypte antique est une ancienne civilisation du nord-est de l'Afrique, concentrée le long du cours inférieur du Nil, dans ce qui constitue aujourd'hui l'Égypte. La civilisation de l'Égypte antique prend forme autour de 3150 av. J.-C. avec l'unification politique de la Haute-Égypte au sud et de la Basse-Égypte au nord sous le règne du premier roi et se développe sur plus de trois millénaires. Son histoire est parsemée d'une série de périodes stables politiquement, entrecoupées de plusieurs périodes intermédiaires, plus troublées. L'Égypte antique atteint son apogée sous le Nouvel Empire puis entre dans une période de lent déclin. Le pays subit les assauts répétés de puissances étrangères dans cette période tardive et le règne des pharaons prend officiellement fin en -30 où l'Empire romain conquiert l'Égypte pour en faire une province.
status: 1

égypte
type: SimpleNonPreferredTerm
modified: 2013-07-05T00:00:00+02:00
created: 2013-07-05T11:27:24+02:00
status: 1

égyptien
type: PreferredTerm
modified: 2013-07-05T00:00:00+02:00
created: 2013-07-05T11:27:24+02:00
status: 1

Amérique du sud
type: Concept
modified: 2019-11-21T14:29:29+01:00
in scheme: Liste d'autorités Domaines - Joconde
broader: Amérique
alternative label: Amérique du Sud
created: 2013-07-05T11:27:24+02:00
status: 1

Amérique du sud
type: PreferredTerm
modified: 2019-11-21T14:29:29+01:00
created: 2013-07-05T11:27:24+02:00
status: 1

copte
type: Concept
modified: 2013-07-05T00:00:00+02:00
in scheme: Liste d'autorités Domaines - Joconde
broader: civilisation
created: 2013-07-05T11:27:24+02:00
definition: Le terme copte désigne une culture dont la langue et l'écriture sont attestées dès le 2e siècle av JC. Cette culture est surtout connue comme celle d’une chrétienté séparée de l'église byzantine après le concile de Chalcédoine en 451. En principe, en histoire de l’art, le terme "copte" s'applique aux productions égyptiennes, de l'époque romaine (30 av JC) jusqu’à l'invasion arabe de 640. [Alexandra Lorquin, Tissus coptes, Paris, RMN, 1992.]
status: 1

copte
type: PreferredTerm
modified: 2013-07-05T00:00:00+02:00
created: 2013-07-05T11:27:24+02:00
status: 1

cartes - plans
type: Concept
modified: 2013-07-05T00:00:00+02:00
in scheme: Liste d'autorités Domaines - Joconde
broader: domaine disciplinaire
created: 2013-07-05T11:27:24+02:00
definition: Carte : Surface plane sur laquelle est représentée la figure de la Terre, du ciel ; par méton., cette représentation. Ce qui représente le globe terrestre ou une de ses parties. (Acad.fr) ; Plan : représentation d'une construction (ou d'un ensemble de constructions, d'un terrain, d'un jardin, etc) en projection horizontale. (Robert)
status: 1

cartes - plans
type: PreferredTerm
modified: 2013-07-05T00:00:00+02:00
created: 2013-07-05T11:27:24+02:00
status: 1

vie professionnelle
type: Concept
modified: 2013-07-05T00:00:00+02:00
in scheme: Liste d'autorités Domaines - Joconde
broader: domaine par type de fonction
created: 2013-07-05T11:27:24+02:00
scope note: Exemples : affiches sur la prévention des accidents du travail (écomusée du Creusot), tracts ou affiches syndicaux, etc.
definition: Regroupe des notions concernant la sécurité sur le lieu de travail, la défense du salarié.
status: 1

vie professionnelle
type: PreferredTerm
modified: 2013-07-05T00:00:00+02:00
created: 2013-07-05T11:27:24+02:00
status: 1

phaléristique
type: Concept
modified: 2013-07-05T00:00:00+02:00
in scheme: Liste d'autorités Domaines - Joconde
broader: domaine disciplinaire
created: 2013-07-05T11:27:24+02:00
scope note: Comprend les décorations militaires, les médailles de concours. Ne concerne pas les médaillons sculptés ou peints. Ne pas confondre avec numismatique.
definition: Etude des ordres, décorations, médailles et insignes de distinction remis à une personne physique ou morale en récompense d'un mérite ou d'un service. [Vient de "phalère" : plaque ronde, que les soldats romains recevaient à titre de décoration ; les phalères étaient en or et se portaient sur la poitrine]
status: 1

phaléristique
type: PreferredTerm
modified: 2013-07-05T00:00:00+02:00
created: 2013-07-05T11:27:24+02:00
status: 1

phénicien
type: Concept
modified: 2013-07-05T00:00:00+02:00
in scheme: Liste d'autorités Domaines - Joconde
broader: civilisation
created: 2013-07-05T11:27:24+02:00
definition: Civilisation des cités-états de la côte syro-palestinienne à partir de 1.000 avant JC. A partir du VIIe siècle avant JC, la Phénicie subira diverses dominations (Assyriens, Babyloniens…).
status: 1

phénicien
type: PreferredTerm
modified: 2013-07-05T00:00:00+02:00
created: 2013-07-05T11:27:24+02:00
status: 1

commerce - économie - finances
type: Concept
modified: 2013-07-05T00:00:00+02:00
in scheme: Liste d'autorités Domaines - Joconde
broader: domaine par type de fonction
created: 2013-07-05T11:27:24+02:00
scope note: Commerce : activités propres à la vente, n'incluant pas de transformation par opposition à l’artisanat. Economie, finances : activités concernant la manipulation de l'argent, l'épargne, etc.
definition: Commerce : Activité qui consiste à acheter et à vendre des marchandises, des denrées, des valeurs, des services, etc., en vue de réaliser un profit. (Acad.fr) Economie : Ensemble des activités humaines et des ressources concourant à la production et à la répartition des richesses. (Acad.fr) Finances : Ensemble des activités ayant trait à l'argent. (Acad.fr)
status: 1

commerce - économie - finances
type: PreferredTerm
modified: 2013-07-05T00:00:00+02:00
created: 2013-07-05T11:27:24+02:00
status: 1

éperonnerie
type: Concept
modified: 2018-12-11T15:12:33+01:00
in scheme: Liste d'autorités Domaines - Joconde
broader: domaine disciplinaire
alternative label: hippiqua
created: 2013-07-05T11:27:24+02:00
scope note: Tout ce qui a trait au cheval. Doubler éventuellement avec sellerie, jeux - sports - loisirs ou transport - communication.
definition: Commerce et fabrication de tout ce qui a rapport au harnachement des chevaux de selle et d'attelage. (Littré) Fabrication et commerce des éperons et autres objets ayant trait au harnachement des chevaux. (Larousse) Fabrication et commerce des pièces de harnachement (Encyclopedia universalis)
status: 1

hippiqua
type: SimpleNonPreferredTerm
modified: 2018-12-11T15:12:33+01:00
created: 2013-07-05T11:27:24+02:00
status: 1

éperonnerie
type: PreferredTerm
modified: 2018-12-11T15:12:33+01:00
created: 2018-12-11T15:12:33+01:00
status: 1

plumasserie
type: Concept
modified: 2013-07-05T00:00:00+02:00
in scheme: Liste d'autorités Domaines - Joconde
broader: domaine par support de conservation
created: 2013-07-05T11:27:24+02:00
definition: Travail, métier du plumassier qui apprête les plumes, notamment pour leur emploi ornemental, qui fait ou vend des ouvrages en plumes. (Acad.fr)
status: 1

plumasserie
type: PreferredTerm
modified: 2013-07-05T00:00:00+02:00
created: 2013-07-05T11:27:24+02:00
status: 1

Asie du sud-est
type: Concept
modified: 2019-11-21T14:28:55+01:00
in scheme: Liste d'autorités Domaines - Joconde
broader: Asie
alternative label: Asie du Sud-Est
created: 2013-07-05T11:27:24+02:00
status: 1

Asie du sud-est
type: PreferredTerm
modified: 2019-11-21T14:28:55+01:00
created: 2013-07-05T11:27:24+02:00
status: 1

sciences naturelles
type: Concept
modified: 2013-07-05T00:00:00+02:00
in scheme: Liste d'autorités Domaines - Joconde
narrower: faune
narrower: botanique
narrower: géologie
broader: domaine disciplinaire
created: 2013-07-05T11:27:24+02:00
definition: Les sciences naturelles renferment toutes les matières scientifiques qui se consacrent à l’étude de la nature. Elles s’intéressent aux aspects physiques de la réalité, contrairement aux sciences sociales qui étudient les facteurs humains.
status: 1

faune
type: Concept
modified: 2013-07-05T00:00:00+02:00
in scheme: Liste d'autorités Domaines - Joconde
broader: sciences naturelles
created: 2013-07-05T11:27:24+02:00
definition: Ensemble des animaux vivant ou ayant vécu dans un milieu, une contrée, un pays. (Acad. fr)
status: 1

sciences naturelles
type: PreferredTerm
modified: 2013-07-05T00:00:00+02:00
created: 2013-07-05T11:27:24+02:00
status: 1

botanique
type: Concept
modified: 2013-07-05T00:00:00+02:00
in scheme: Liste d'autorités Domaines - Joconde
broader: sciences naturelles
alternative label: flore
created: 2013-07-05T11:27:24+02:00
definition: Science qui a pour objet la connaissance, la description et la classification des végétaux (Acad. fr)
status: 1

géologie
type: Concept
modified: 2013-07-05T00:00:00+02:00
in scheme: Liste d'autorités Domaines - Joconde
narrower: minéralogie
broader: sciences naturelles
created: 2013-07-05T11:27:24+02:00
definition: Science qui a pour objet l'étude de l'écorce terrestre, de sa formation, de la nature et de la situation des roches et terrains qui la composent. (Acad. fr)
status: 1

mycologie
type: Concept
modified: 2014-12-08T10:26:55+01:00
in scheme: Liste d'autorités Domaines - Joconde
broader: sciences naturelles
created: 2014-12-08T10:25:50+01:00
definition: Etude scientifique des champignons. (Larousse)
status: 1

archéologie
type: Concept
modified: 2013-07-05T00:00:00+02:00
in scheme: Liste d'autorités Domaines - Joconde
broader: domaine disciplinaire
created: 2013-07-05T11:27:24+02:00
scope note: Cette notion n'est à utiliser que dans le contexte d'un musée polyvalent.
definition: Etude des traces matérielles laissées par une civilisation ancienne. (Acad.fr)
status: 1

anthropologie
type: Concept
modified: 2013-07-05T00:00:00+02:00
in scheme: Liste d'autorités Domaines - Joconde
broader: domaine disciplinaire
created: 2013-07-05T11:27:24+02:00
definition: Etude des traits distinctifs qui caractérisent les populations humaines. Discipline qui élabore les données de l'ethnographie et de l'ethnologie pour contribuer à une connaissance générale de l'homme. (Acad. fr)
status: 1

arts décoratifs
type: Concept
modified: 2013-07-05T00:00:00+02:00
in scheme: Liste d'autorités Domaines - Joconde
broader: domaine disciplinaire
created: 2013-07-05T11:27:24+02:00
definition: Les arts décoratifs sont pratiqués par les métiers d'art traditionnellement définis par leurs productions ornementales et fonctionnelles, et par les matériaux auxquels ils donnent forme : la céramique, le bois, le verre, le métal, le textile, le stuc ou la pierre, voire la pierre précieuse.
status: 1

sigillographie
type: Concept
modified: 2013-07-05T00:00:00+02:00
in scheme: Liste d'autorités Domaines - Joconde
broader: domaine disciplinaire
created: 2013-07-05T11:27:24+02:00
definition: Etude scientifique des sceaux (cachets officiels) et spécialement des sceaux de chartes médiévales. (Robert)
status: 1

sciences - techniques
type: Concept
modified: 2013-07-05T00:00:00+02:00
in scheme: Liste d'autorités Domaines - Joconde
broader: domaine disciplinaire
created: 2013-07-05T11:27:24+02:00
definition: Sciences : Tout corps de connaissance ayant un objet déterminé et reconnu, et une méthode propre ; domaine du savoir, en ce sens. Ensemble de connaissances, d'études d'une valeur universelle, caractérisées par un objet et une méthode déterminés, et fondées sur des relations objectives vérifiables. (Robert) Techniques : ensemble de procédés employés pour produire une œuvre ou obtenir un résultat déterminé. Ensemble de procédés méthodiques, fondés sur des connaissances scientifiques, employés à la production. (Robert)
status: 1

domaine disciplinaire
type: PreferredTerm
modified: 2013-07-05T00:00:00+02:00
created: 2013-07-05T11:27:24+02:00
status: 1

beaux-arts
type: Concept
modified: 2013-07-05T00:00:00+02:00
in scheme: Liste d'autorités Domaines - Joconde
broader: domaine disciplinaire
created: 2013-07-05T11:27:24+02:00
scope note: Cette notion n'est à utiliser que dans le contexte d'un musée polyvalent.
definition: Ensemble des arts majeurs ou simplement des arts, soit la peinture, la sculpture, la gravure, l'architecture, appelées aussi arts plastiques, auxquelles s'ajoutent la musique et la danse. (Acad. fr.)
status: 1

numismatique
type: Concept
modified: 2013-07-05T00:00:00+02:00
in scheme: Liste d'autorités Domaines - Joconde
broader: domaine disciplinaire
created: 2013-07-05T11:27:24+02:00
scope note: Seules les médailles commémorant un événement ou la fondation d'un monument, non remises à une personne en particulier, relèvent de la numismatique. Ne pas confondre avec phaléristique.
definition: Qui se rapporte aux monnaies et médailles et à leur étude. Science des monnaies et des médailles. (Acad. fr.)
status: 1

histoire
type: Concept
modified: 2013-07-05T00:00:00+02:00
in scheme: Liste d'autorités Domaines - Joconde
broader: domaine disciplinaire
created: 2013-07-05T11:27:24+02:00
scope note: Concerne les objets issus d'un contexte historique, témoins d'un moment remarquable de l'histoire d'un pays : wagon de Rethondes dans lequel fut signé l'armistice de 1918, la pantoufle de Marie-Antoinette montant à l'échafaud ... Pour l'iconographie d'une scène historique, utiliser le champ Sujet représenté.
definition: Relation, connaissance des faits relatifs au passé des sociétés humaines ; suite, ensemble de ces faits. (Acad.fr)
status: 1

épigraphie
type: Concept
modified: 2013-07-05T00:00:00+02:00
in scheme: Liste d'autorités Domaines - Joconde
broader: domaine disciplinaire
created: 2013-07-05T11:27:24+02:00
definition: Science qui a pour objet l'étude des inscriptions gravées sur la pierre ou le métal. (Acad. fr)
status: 1

ethnologie
type: Concept
modified: 2013-07-05T00:00:00+02:00
in scheme: Liste d'autorités Domaines - Joconde
broader: domaine disciplinaire
created: 2013-07-05T11:27:24+02:00
scope note: Cette notion n'est à utiliser que dans le contexte d'un musée polyvalent.
definition: Science qui, partant des phénomènes observés par l'ethnographie, les analyse, les classe, en fait la comparaison systématique et cherche à en fournir une théorie synthétique et explicative. (Acad.fr) Etude descriptive des activités d'un groupe humain déterminé : techniques matérielles, organisation sociale, croyances religieuses, mode de transmission des instruments de travail, d'exploitation du sol, structures de la parenté. (Larousse)
status: 1

serrurerie
type: PreferredTerm
modified: 2013-07-05T00:00:00+02:00
created: 2013-07-05T11:27:24+02:00
status: 1

métrologie - instruments de mesure
type: Concept
modified: 2013-07-05T00:00:00+02:00
in scheme: Liste d'autorités Domaines - Joconde
broader: domaine par type de fonction
created: 2013-07-05T11:27:24+02:00
scope note: Voir horlogerie.
definition: Discipline qui a pour objet les méthodes et les techniques employées pour obtenir la plus grande précision dans les mesures. Anciennt. Science des poids et mesures utilisés par les différents peuples (Acad.fr) Science des mesures ; traité sur les poids et mesures (Robert)
status: 1

métrologie - instruments de mesure
type: PreferredTerm
modified: 2013-07-05T00:00:00+02:00
created: 2013-07-05T11:27:24+02:00
status: 1

âge du bronze
type: Concept
modified: 2013-07-05T00:00:00+02:00
in scheme: Liste d'autorités Domaines - Joconde
broader: chronologie
created: 2013-07-05T11:27:24+02:00
definition: Après la Préhistoire, l'âge du bronze est la première période de la "Protohistoire", appelée aussi "âges des métaux". Marqué par d'importantes avancées, tant technologiques que sociales, l'âge du bronze constitue une étape importante de l'évolution des sociétés européennes. Elle se caractérise par l'usage de la métallurgie du bronze, alliage principalement composé de cuivre et d'étain.
status: 1

âge du bronze
type: PreferredTerm
modified: 2013-07-05T00:00:00+02:00
created: 2013-07-05T11:27:24+02:00
status: 1

Amérique
type: PreferredTerm
modified: 2013-07-05T00:00:00+02:00
created: 2013-07-05T11:27:24+02:00
status: 1

Amérique du nord
type: Concept
modified: 2019-11-21T14:29:12+01:00
in scheme: Liste d'autorités Domaines - Joconde
broader: Amérique
alternative label: Amérique du Nord
created: 2013-07-05T11:27:24+02:00
status: 1

imprimé
type: Concept
modified: 2013-07-05T00:00:00+02:00
in scheme: Liste d'autorités Domaines - Joconde
broader: domaine par support de conservation
created: 2013-07-05T11:27:24+02:00
definition: Document imprimé, produit par l'imprimerie. (Acad. fr)
status: 1

imprimé
type: PreferredTerm
modified: 2013-07-05T00:00:00+02:00
created: 2013-07-05T11:27:24+02:00
status: 1

glyptique
type: PreferredTerm
modified: 2013-07-05T00:00:00+02:00
created: 2013-07-05T11:27:24+02:00
status: 1

ethnologie
type: PreferredTerm
modified: 2013-07-05T00:00:00+02:00
created: 2013-07-05T11:27:24+02:00
status: 1

sigillographie
type: PreferredTerm
modified: 2013-07-05T00:00:00+02:00
created: 2013-07-05T11:27:24+02:00
status: 1

orfèvrerie
type: PreferredTerm
modified: 2013-07-05T00:00:00+02:00
created: 2013-07-05T11:27:24+02:00
status: 1

chypriote
type: Concept
modified: 2013-07-05T00:00:00+02:00
in scheme: Liste d'autorités Domaines - Joconde
broader: civilisation
created: 2013-07-05T11:27:24+02:00
definition: Relatif à l'île de Chypre. (Acad.fr)
status: 1

chypriote
type: PreferredTerm
modified: 2013-07-05T00:00:00+02:00
created: 2013-07-05T11:27:24+02:00
status: 1

ferronnerie
type: PreferredTerm
modified: 2013-07-05T00:00:00+02:00
created: 2013-07-05T11:27:24+02:00
status: 1

énergie
type: Concept
modified: 2013-07-05T00:00:00+02:00
in scheme: Liste d'autorités Domaines - Joconde
broader: domaine par type de fonction
created: 2013-07-05T11:27:24+02:00
scope note: Concerne les objets générateurs d'énergie (éolienne, chaudière, pompe à essence…)
definition: Capacité qu'a un corps, un système, de produire un travail. Matière première ou phénomène naturel pouvant fournir un travail ; la force qu'ils produisent. Par extension : l'ensemble de ces matières premières, de ces phénomènes naturels. (Acad.fr)
status: 1

énergie
type: PreferredTerm
modified: 2013-07-05T00:00:00+02:00
created: 2013-07-05T11:27:24+02:00
status: 1

punique
type: Concept
modified: 2013-07-05T00:00:00+02:00
in scheme: Liste d'autorités Domaines - Joconde
broader: civilisation
created: 2013-07-05T11:27:24+02:00
definition: La création de Carthage par des exilés de Tyr vers 814 avant JC marque le début de la civilisation punique. Celle-ci étendra sa domination sur la Méditerranée occidentale jusqu’à la destruction de Carthage par Rome en 146 avant JC.
status: 1

punique
type: PreferredTerm
modified: 2013-07-05T00:00:00+02:00
created: 2013-07-05T11:27:24+02:00
status: 1

verrerie
type: PreferredTerm
modified: 2013-07-05T00:00:00+02:00
created: 2013-07-05T11:27:24+02:00
status: 1

balnéaire
type: Concept
modified: 2013-07-05T00:00:00+02:00
in scheme: Liste d'autorités Domaines - Joconde
broader: jeux - sports - loisirs
created: 2013-07-05T11:27:24+02:00
definition: Relatif aux bains de mer. (Acad.fr)
status: 1

jeux - sports - loisirs
type: Concept
modified: 2013-07-05T00:00:00+02:00
in scheme: Liste d'autorités Domaines - Joconde
narrower: balnéaire
broader: domaine par type de fonction
created: 2013-07-05T11:27:24+02:00
definition: Jeux : Action de jouer ; ce qui se fait par esprit de gaieté et par amusement. Activité à laquelle on se livre pour s'amuser, se divertir, sans qu'il y ait aucun enjeu. Divertissement soumis à certaines règles et permettant, lorsqu'il est partagé par plusieurs joueurs, de déterminer des gagnants et des perdants. Ensemble d'objets, d'éléments employés pour des divertissements ou certains exercices de récréation réclamant sagacité, adresse ou chance. (Acad.fr) Sports : activité physique exercée dans le sens du jeu, de la lutte et de l'effort, et dont la pratique suppose un entrainement méthodique, le respect de certaines règles et disciplines. Un sport : chacune des formes particulières et réglementées de cette activité. (Robert) Loisirs : Temps dont on peut disposer à son gré sans manquer à ses obligations. Par métonymie, souvent au pluriel : occupations, activités auxquelles on s'adonne dans ses moments de liberté. (Acad.fr)
status: 1

balnéaire
type: PreferredTerm
modified: 2013-07-05T00:00:00+02:00
created: 2013-07-05T11:27:24+02:00
status: 1

gaulois
type: Concept
modified: 2013-07-05T00:00:00+02:00
in scheme: Liste d'autorités Domaines - Joconde
broader: civilisation
created: 2013-07-05T11:27:24+02:00
definition: Gaulois : nom donné dans l'Antiquité aux régions comprises entre le Rhin, les Alpes, la Méditerranée, les Pyrénées et l'Atlantique. La Gaule correspond essentiellement à la France, mais, en ayant le Rhin pour limite, elle comprend aussi les actuels Luxembourg et Belgique, ainsi qu’une partie des Pays-Bas, de l’Allemagne et de la Suisse. Elle paraît avoir été habitée principalement par des Celtes, à une certaine époque ; le nom de Gaulois passait dans l'Antiquité pour synonyme de « Celte » (première mention chez Hérodote, vers 450 avant J.-C.), mais il prit de plus en plus le sens d'« habitant de la Gaule », et l'usage moderne est d'appeler surtout Gaulois les Celtes de Gaule. (Larousse)
status: 1

gaulois
type: PreferredTerm
modified: 2013-07-05T00:00:00+02:00
created: 2013-07-05T11:27:24+02:00
status: 1

archéologie
type: PreferredTerm
modified: 2019-01-11T10:27:16+01:00
created: 2013-07-05T11:27:24+02:00
status: 1

grec
type: Concept
modified: 2013-07-05T00:00:00+02:00
in scheme: Liste d'autorités Domaines - Joconde
broader: civilisation
created: 2013-07-05T11:27:24+02:00
definition: Grec : en rapport ici avec l'expression « Grèce antique » renvoie à la civilisation des peuples de langue et de culture grecques durant l'Antiquité.
status: 1

grec
type: PreferredTerm
modified: 2013-07-05T00:00:00+02:00
created: 2013-07-05T11:27:24+02:00
status: 1

photographie
type: Concept
modified: 2013-07-05T00:00:00+02:00
in scheme: Liste d'autorités Domaines - Joconde
broader: domaine par support de conservation
created: 2013-07-05T11:27:24+02:00
scope note: Comprend les tirages papier, les plaques de verre, les cartes postales, les appareils photos.
definition: Procédé technique permettant d'obtenir l'image durable des objets, par l'action de la lumière sur une surface sensible. Par extension, la technique, l'art de prendre des images photographiques ; image obtenue par le procédé de la photographie. (Robert)
status: 1

photographie
type: PreferredTerm
modified: 2013-07-05T00:00:00+02:00
created: 2013-07-05T11:27:24+02:00
status: 1

tabletterie
type: PreferredTerm
modified: 2013-07-05T00:00:00+02:00
created: 2013-07-05T11:27:24+02:00
status: 1

cinéma
type: Concept
modified: 2015-03-23T10:48:50+01:00
in scheme: Liste d'autorités Domaines - Joconde
broader: domaine par support de conservation
created: 2015-03-23T10:48:50+01:00
definition: Appareil cinématographique. (Acad. fr) L'art qui a pour objet de réaliser des films. (Acad. fr)
status: 1

cinéma
type: PreferredTerm
modified: 2015-03-23T10:48:50+01:00
created: 2015-03-23T10:48:50+01:00
status: 1

chalcolithique
type: Concept
modified: 2013-07-05T00:00:00+02:00
in scheme: Liste d'autorités Domaines - Joconde
broader: chronologie
created: 2013-07-05T11:27:24+02:00
definition: ​L’âge du cuivre, appelé aussi Chalcolithique (du grec khalkos : cuivre, et lithos : pierre), est la période durant laquelle l’homme fabrique des outils en silex en même temps qu’il découvre et transforme le cuivre. Ces premiers objets apparaissent dès 3000 av. J-C. en France. Les sociétés de l’âge du cuivre sont basées sur un mode de vie agro-pastoraliste. La diffusion de ce métal dans le monde, et en Europe en particulier, a été un détonateur pour les techniques de métallurgie et les modifications sociales et économiques qui suivirent aux âges du bronze et du fer.
status: 1

chalcolithique
type: PreferredTerm
modified: 2013-07-05T00:00:00+02:00
created: 2013-07-05T11:27:24+02:00
status: 1

mycologie
type: PreferredTerm
modified: 2014-12-08T10:26:55+01:00
created: 2014-12-08T10:25:50+01:00
status: 1

minéralogie
type: Concept
modified: 2013-07-05T00:00:00+02:00
in scheme: Liste d'autorités Domaines - Joconde
broader: géologie
created: 2013-07-05T11:27:24+02:00
definition: Science qui traite des minéraux constituant les matériaux de l'écorce terrestre. (Robert)
status: 1

géologie
type: PreferredTerm
modified: 2013-07-05T00:00:00+02:00
created: 2013-07-05T11:27:24+02:00
status: 1

miniature
type: Concept
modified: 2013-07-05T00:00:00+02:00
in scheme: Liste d'autorités Domaines - Joconde
broader: domaine par support de conservation
created: 2013-07-05T11:27:24+02:00
scope note: Redoubler, si nécessaire, avec émaillerie. A ne pas confondre avec enluminure.
definition: Genre de peinture délicate de petites dimensions.(Robert)
status: 1

miniature
type: PreferredTerm
modified: 2013-07-05T00:00:00+02:00
created: 2013-07-05T11:27:24+02:00
status: 1

paléolithique
type: Concept
modified: 2013-07-05T00:00:00+02:00
in scheme: Liste d'autorités Domaines - Joconde
broader: chronologie
created: 2013-07-05T11:27:24+02:00
definition: Le terme Paléolithique a été créé à la fin du XIXe siècle. Son étymologie du grec ancien signifie « l’âge de la pierre ancienne », par opposition à « l’âge de la pierre nouvelle », qui désigne le Néolithique qui lui succédera. La période Paléolithique part des premiers témoins de l’activité humaine il y a plus de trois millions d’années jusqu’au grand changement des sociétés humaines qu’est l’invention de l’agriculture et de l’élevage. Cette période est rythmée par de grands changements climatiques à l’échelle de la planète qui influencent l’évolution des Hommes et de leurs sociétés. Très tôt l’humanité conquiert toutes les parties habitables de la planète : son champ d’étude est sans frontière. L’Europe, quant à elle, est occupée de manière certaine depuis 800 000 ans. Ce temps très long a été divisé en plusieurs périodes, correspondant à des changements techniques visibles sur les vestiges découverts par les archéologues (outils en pierre ou en os).
status: 1

mésolithique
type: Concept
modified: 2013-07-05T00:00:00+02:00
in scheme: Liste d'autorités Domaines - Joconde
broader: chronologie
created: 2013-07-05T11:27:24+02:00
definition: Au Mésolithique, les successeurs des hommes du Paléolithique s’adaptent au brusque réchauffement climatique du début de notre actuelle période interglaciaire (vers - 9600). Ils conservent néanmoins un mode de vie basé sur la chasse, la pêche et la cueillette, qui s’achève avec l’arrivée des agriculteurs-éleveurs du Néolithique, autour de - 6000 en France.
status: 1

temps modernes
type: Concept
modified: 2013-07-05T00:00:00+02:00
in scheme: Liste d'autorités Domaines - Joconde
broader: chronologie
created: 2013-07-05T11:27:24+02:00
definition: L'Époque moderne couvre les trois siècles qui séparent la fin du Moyen Âge de la Révolution française. En France, elle peut être subdivisée en trois périodes, marquées par d’importantes transformations politiques et artistiques : la Renaissance, de la fin du XVe siècle aux premières décennies du XVIIe siècle ; l’avènement de l’État-nation sous le règne de Louis XIV, XVIIe et début du XVIIIe siècle ; le siècle des Lumières, le XVIIIe siècle jusqu’à la Révolution.
status: 1

néolithique
type: Concept
modified: 2013-07-05T00:00:00+02:00
in scheme: Liste d'autorités Domaines - Joconde
broader: chronologie
created: 2013-07-05T11:27:24+02:00
definition: En France, la période néolithique, qui correspond aux premières sociétés de paysans, est comprise entre 6000 et 2200 avant notre ère. Elle est caractérisée par l’abandon du mode de vie nomade, l’utilisation de la céramique pour fabriquer des poteries et le polissage de certains outils en pierre tels que les haches.Mais c’est dans le Croissant Fertile vers 12000 avant notre ère, que l’Homme commence à construire des maisons puis, petit à petit, à domestiquer des espèces végétales (blé, orge) et animales (mouton, chèvre).
status: 1

médiéval
type: Concept
modified: 2019-10-25T11:20:53+02:00
in scheme: Liste d'autorités Domaines - Joconde
broader: chronologie
alternative label: Moyen-Age
alternative label: moyen âge
alternative label: moyen-âge
alternative label: Moyen Age
created: 2013-07-05T11:27:24+02:00
definition: Période médiévale ou ​Moyen-âge : les historiens des textes le font débuter en 476, à la fin du règne de Romulus Augustule, dernier empereur romain d'Occident, ou en 496, date du baptême de Clovis. Il se termine soit en 1453, avec la prise de Constantinople par les Turcs et la fin de l'Empire romain d'Orient, soit en 1492, date de l’accostage de Christophe Colomb sur le continent américain, ou encore à la mort de Louis XI en 1481.
status: 1

précolombien
type: Concept
modified: 2013-07-05T00:00:00+02:00
in scheme: Liste d'autorités Domaines - Joconde
broader: chronologie
created: 2013-07-05T11:27:24+02:00
definition: Précolombien : relatif aux civilisations et aux ethnies de l'Amérique, principalement du Pérou et de l'Amérique centrale, qui existaient antérieurement à sa découverte par Christophe Colomb et à sa conquête par les Espagnols.
status: 1

chronologie
type: PreferredTerm
modified: 2019-02-07T15:48:49+01:00
created: 2013-07-05T11:27:24+02:00
status: 1

moderne
type: Concept
modified: 2013-07-05T00:00:00+02:00
in scheme: Liste d'autorités Domaines - Joconde
broader: chronologie
created: 2013-07-05T11:27:24+02:00
scope note: Par opposition à Antique, différent de Temps modernes.
status: 1

âge du fer
type: Concept
modified: 2013-07-05T00:00:00+02:00
in scheme: Liste d'autorités Domaines - Joconde
broader: chronologie
created: 2013-07-05T11:27:24+02:00
definition: L’âge du Fer, qui correspond à la seconde partie de la Protohistoire, s’étend de 800 avant notre ère à la fin du Ier siècle de notre ère. Durant toute cette époque, les territoires correspondant à la France actuelle sont progressivement fréquentés par des populations qui possèdent l’écriture (les Grecs, les Romains). En revanche, les peuples locaux (Celtes, Gaulois, Ligures, Ibères…) écrivent peu, ou pas du tout. C’est donc l’archéologie qui fournit, en plus des quelques textes grecs ou latins, l’essentiel de nos connaissances sur ces groupes humains.
status: 1

élément d'impression
type: PreferredTerm
modified: 2013-07-05T00:00:00+02:00
created: 2013-07-05T11:27:24+02:00
status: 1

horlogerie
type: PreferredTerm
modified: 2013-07-05T00:00:00+02:00
created: 2013-07-05T11:27:24+02:00
status: 1

épigraphie
type: PreferredTerm
modified: 2013-07-05T00:00:00+02:00
created: 2013-07-05T11:27:24+02:00
status: 1

romain
type: Concept
modified: 2013-07-05T00:00:00+02:00
in scheme: Liste d'autorités Domaines - Joconde
broader: civilisation
created: 2013-07-05T11:27:24+02:00
definition: Qui caractérise la Rome antique, sa population, son organisation, son mode de vie. (Centre national de recherches textuelles et lexicales)
status: 1

romain
type: PreferredTerm
modified: 2013-07-05T00:00:00+02:00
created: 2013-07-05T11:27:24+02:00
status: 1

croyances - coutumes
type: Concept
modified: 2013-07-05T00:00:00+02:00
in scheme: Liste d'autorités Domaines - Joconde
broader: domaine par type de fonction
created: 2013-07-05T11:27:24+02:00
scope note: Inclut les notions de religion, croyance, dévotion, cérémonie religieuse, équipement religieux, mobilier religieux, vêtements religieux, monuments funéraires, sarcophages, objets liturgiques, etc.
definition: Croyance : Par opposition au savoir rationnel et à la certitude objective. Conviction intime, concernant l'existence d'un être, la réalité d'une situation, la probabilité d'un évènement. Par métonymie : toute opinion, quel que soit son fondement ; en particulier, conception d'ordre moral, politique, religieux. Religieux : le contenu de la foi, les propositions d'une religion révélée. (Acad.fr) Coutume : Usage qui s'est établi peu à peu dans une collectivité ; pratique usuelle dans un pays, dans un certain milieu. (Acad.fr)
status: 1

croyances - coutumes
type: PreferredTerm
modified: 2013-07-05T00:00:00+02:00
created: 2013-07-05T11:27:24+02:00
status: 1

émaillerie
type: PreferredTerm
modified: 2013-07-05T00:00:00+02:00
created: 2013-07-05T11:27:24+02:00
status: 1

sellerie
type: PreferredTerm
modified: 2013-07-05T00:00:00+02:00
created: 2013-07-05T11:27:24+02:00
status: 1

Amérique du nord
type: PreferredTerm
modified: 2019-11-21T14:29:12+01:00
created: 2013-07-05T11:27:24+02:00
status: 1

sciences - techniques
type: PreferredTerm
modified: 2013-07-05T00:00:00+02:00
created: 2013-07-05T11:27:24+02:00
status: 1

carolingien
type: Concept
modified: 2013-07-05T00:00:00+02:00
in scheme: Liste d'autorités Domaines - Joconde
broader: civilisation
created: 2013-07-05T11:27:24+02:00
definition: Relatif à la dynastie fondée par Pépin le Bref au VIIIe siècle, et dont le représentant le plus illustre fut son fils Charlemagne. (Acad.fr)
status: 1

carolingien
type: PreferredTerm
modified: 2013-07-05T00:00:00+02:00
created: 2013-07-05T11:27:24+02:00
status: 1

hygiène - médecine - santé
type: Concept
modified: 2013-07-05T00:00:00+02:00
in scheme: Liste d'autorités Domaines - Joconde
broader: domaine par type de fonction
created: 2013-07-05T11:27:24+02:00
scope note: Exemple : comprend les pots à pharmacie etc.
definition: Hygiène : ensemble des principes et des pratiques qui visent à conserver la santé et à assurer l'intégrité des fonctions de l'organisme. Ensemble des soins nécessaires à la propreté du corps. (Acad.fr) Médecine : science qui a pour objet la conservation ou le rétablissement de la santé ; art de prévenir et de soigner les maladies de l'homme. (Robert) Santé : science ayant pour objet la santé ; art de prévenir et de traiter les maladies. (Acad. fr) ; bon état physiologique d'un être vivant, fonctionnement régulier et harmonieux de l'organisme pendant une période appréciable (indépendamment des anomalies ou des traumatismes qui n'affectent pas les fonctions vitales : un aveugle peut avoir la santé). (Robert)
status: 1

hygiène - médecine - santé
type: PreferredTerm
modified: 2013-07-05T00:00:00+02:00
created: 2013-07-05T11:27:24+02:00
status: 1

vitrail
type: PreferredTerm
modified: 2013-07-05T00:00:00+02:00
created: 2013-07-05T11:27:24+02:00
status: 1

jeux - sports - loisirs
type: PreferredTerm
modified: 2020-11-20T13:41:40+01:00
created: 2013-07-05T11:27:24+02:00
status: 1

lutherie
type: PreferredTerm
modified: 2013-07-05T00:00:00+02:00
created: 2013-07-05T11:27:24+02:00
status: 1

peinture
type: Concept
modified: 2013-07-05T00:00:00+02:00
in scheme: Liste d'autorités Domaines - Joconde
broader: domaine par support de conservation
created: 2013-07-05T11:27:24+02:00
definition: Inclut fresque, peintures acrylique, à l'huile, à la colle, à la cire, sur toile, bois, carton, papier, métal, plastique ou minéral. Inclut également les œuvres extrême-orientales (Chine, Japon…) à l'encre ou aux couleurs légères sur papier.
status: 1

peinture
type: PreferredTerm
modified: 2013-07-05T00:00:00+02:00
created: 2013-07-05T11:27:24+02:00
status: 1

ibérique
type: Concept
modified: 2013-07-05T00:00:00+02:00
in scheme: Liste d'autorités Domaines - Joconde
broader: civilisation
created: 2013-07-05T11:27:24+02:00
definition: Relatif à l'Ibérie et aux anciens Ibères. (Acad.fr)
status: 1

ibérique
type: PreferredTerm
modified: 2013-07-05T00:00:00+02:00
created: 2013-07-05T11:27:24+02:00
status: 1

faune
type: PreferredTerm
modified: 2013-07-05T00:00:00+02:00
created: 2013-07-05T11:27:24+02:00
status: 1

Afrique du nord
type: Concept
modified: 2019-11-21T14:30:17+01:00
in scheme: Liste d'autorités Domaines - Joconde
broader: Afrique
alternative label: Afrique du Nord
created: 2013-07-05T11:27:24+02:00
status: 1

Afrique
type: Concept
modified: 2013-07-05T00:00:00+02:00
in scheme: Liste d'autorités Domaines - Joconde
narrower: Afrique du nord
narrower: Afrique sub-saharienne
broader: géographie
created: 2013-07-05T11:27:24+02:00
status: 1

Afrique du nord
type: PreferredTerm
modified: 2019-11-21T14:30:17+01:00
created: 2013-07-05T11:27:24+02:00
status: 1

Asie occidentale
type: Concept
modified: 2013-07-05T00:00:00+02:00
in scheme: Liste d'autorités Domaines - Joconde
broader: Asie
created: 2013-07-05T11:27:24+02:00
status: 1

Asie occidentale
type: PreferredTerm
modified: 2013-07-05T00:00:00+02:00
created: 2013-07-05T11:27:24+02:00
status: 1

environnement
type: Concept
modified: 2013-07-05T00:00:00+02:00
in scheme: Liste d'autorités Domaines - Joconde
broader: domaine par type de fonction
created: 2013-07-05T11:27:24+02:00
scope note: Concerne des objets tels que des affiches ou tracts écologiques, engrais ou traitements chimiques …
definition: Ensemble des agents chimiques, physiques, biologiques, et des facteurs sociaux exerçant, à un moment donné, une influence sur les êtres vivants et les activités humaines. (Acad.fr)
status: 1

environnement
type: PreferredTerm
modified: 2013-07-05T00:00:00+02:00
created: 2013-07-05T11:27:24+02:00
status: 1

vie domestique
type: Concept
modified: 2013-07-05T00:00:00+02:00
in scheme: Liste d'autorités Domaines - Joconde
broader: domaine par type de fonction
created: 2013-07-05T11:27:24+02:00
scope note: Inclut les notions d'activité domestique, alimentation, objets domestiques, vaisselle, habitat, confort domestique, foyer, chaleur, luminaire, décoration intérieure, bibelots, décors, objets de rangement, entretien de la maison, entretien du linge, linge de maison, linge de table, entretien du petit matériel, entretien et réparation textile, etc.
definition: Qui est de la maison ; qui concerne la vie de la maison. (Acad.fr)
status: 1

vie domestique
type: PreferredTerm
modified: 2013-07-05T00:00:00+02:00
created: 2013-07-05T11:27:24+02:00
status: 1

oeuvre en 3 dimensions
type: Concept
modified: 2013-07-05T00:00:00+02:00
in scheme: Liste d'autorités Domaines - Joconde
broader: domaine par support de conservation
created: 2013-07-05T11:27:24+02:00
scope note: Concerne l'art contemporain ; installation
status: 1

oeuvre en 3 dimensions
type: PreferredTerm
modified: 2013-07-05T00:00:00+02:00
created: 2013-07-05T11:27:24+02:00
status: 1

dinanderie
type: PreferredTerm
modified: 2013-07-05T00:00:00+02:00
created: 2013-07-05T11:27:24+02:00
status: 1

médiéval
type: PreferredTerm
modified: 2019-10-25T11:20:53+02:00
created: 2013-07-05T11:27:24+02:00
status: 1

Moyen-Age
type: SimpleNonPreferredTerm
modified: 2019-10-25T11:20:53+02:00
created: 2013-07-05T11:27:24+02:00
status: 1

métallurgie
type: PreferredTerm
modified: 2013-07-05T00:00:00+02:00
created: 2013-07-05T11:27:24+02:00
status: 1

industrie lithique
type: PreferredTerm
modified: 2013-07-05T00:00:00+02:00
created: 2013-07-05T11:27:24+02:00
status: 1

inca
type: Concept
modified: 2013-07-05T00:00:00+02:00
in scheme: Liste d'autorités Domaines - Joconde
broader: civilisation
created: 2013-07-05T11:27:24+02:00
definition: Nom des souverains successifs qui, avant la conquête espagnole, régnèrent sur le Pérou et les régions limitrophes. Par extension Les Incas, dans cet empire, les membres de l'aristocratie. (Acad. fr)
status: 1

inca
type: PreferredTerm
modified: 2013-07-05T00:00:00+02:00
created: 2013-07-05T11:27:24+02:00
status: 1

basque
type: Concept
modified: 2013-07-05T00:00:00+02:00
in scheme: Liste d'autorités Domaines - Joconde
broader: civilisation
created: 2013-07-05T11:27:24+02:00
definition: Les Basques constituent une population autochtone de langue pré indo-européenne, implantée principalement dans le Pays basque, à cheval sur le sud-ouest de la France et au nord de l'Espagne. Une forte émigration historique a engendré une diaspora basque, principalement établie en Amérique du Sud. Leur enracinement dans cette partie de l'Europe depuis la Préhistoire tend à les classer au rang d’ancêtre.
status: 1

basque
type: PreferredTerm
modified: 2013-07-05T00:00:00+02:00
created: 2013-07-05T11:27:24+02:00
status: 1

anthropologie
type: PreferredTerm
modified: 2013-07-05T00:00:00+02:00
created: 2013-07-05T11:27:24+02:00
status: 1

art mobilier
type: Concept
modified: 2013-07-05T00:00:00+02:00
in scheme: Liste d'autorités Domaines - Joconde
broader: domaine par support de conservation
created: 2013-07-05T11:27:24+02:00
scope note: Concerne exclusivement l'archéologie. Ce terme s'applique à tout objet (outils, armes…) portant un décor abondant ou non, aux objets à suspendre (éléments de parure, rondelles, contours découpés), aux statuettes et aux plaquettes gravées. [D'après Lantier, Leroi-Gourhan, Baffier] Cf art pariétal, industrie lithique, industrie osseuse.
definition: L'art mobilier est une forme d'art préhistorique consistant en la décoration de petits objets facilement transportables (à la différence de l'art pariétal) dont le support est minéral ou organique (os, bois de renne, ivoire). [D'après Baffier, Lantier, Leroi-Gourhan]
status: 1

art mobilier
type: PreferredTerm
modified: 2013-07-05T00:00:00+02:00
created: 2013-07-05T11:27:24+02:00
status: 1

gallo-romain
type: Concept
modified: 2013-07-05T00:00:00+02:00
in scheme: Liste d'autorités Domaines - Joconde
broader: civilisation
alternative label: gallo romain
created: 2013-07-05T11:27:24+02:00
definition: L'antiquité gallo-romaine : la civilisation romaine, qui se déroule sur douze siècles en Italie, du VIIIe siècle avant notre ère au Ve siècle de notre ère, s’est constamment nourrie d’influences et d’emprunts. Elle s’étend hors d'Italie dès les IIIe-IIe siècles avant notre ère.
status: 1

gallo-romain
type: PreferredTerm
modified: 2013-07-05T00:00:00+02:00
created: 2013-07-05T11:27:24+02:00
status: 1

gallo romain
type: SimpleNonPreferredTerm
modified: 2013-07-05T00:00:00+02:00
created: 2013-07-05T11:27:24+02:00
status: 1

âge du fer
type: PreferredTerm
modified: 2013-07-05T00:00:00+02:00
created: 2013-07-05T11:27:24+02:00
status: 1

minéralogie
type: PreferredTerm
modified: 2013-07-05T00:00:00+02:00
created: 2013-07-05T11:27:24+02:00
status: 1

vie politique - administrative
type: Concept
modified: 2013-07-05T00:00:00+02:00
in scheme: Liste d'autorités Domaines - Joconde
broader: domaine par type de fonction
created: 2013-07-05T11:27:24+02:00
scope note: Ex : affiches ou tracts électoraux, photographies d'un homme politique inaugurant le salon de l'agriculture, d'un préfet remettant les palmes académiques ...
definition: Regroupe plusieurs notions : Architecture de la vie politique et administrative, Communauté politique, Activité politique, Régime politique, Type d'Etat, Constitution, Personnage politique, Profession adminsitrative et judiciaire, Le pouvoir, Service public, Numéraire, Relations internationales, Colonisation, Manifestations officielles. cf. Thesaurus iconographique, système descriptif des représentations, François Garnier, Le Léopard d'Or, 1984, p. 38.
status: 1

vie politique - administrative
type: PreferredTerm
modified: 2020-10-20T17:42:47+02:00
created: 2013-07-05T11:27:24+02:00
status: 1

Afrique sub-saharienne
type: Concept
modified: 2013-07-05T00:00:00+02:00
in scheme: Liste d'autorités Domaines - Joconde
broader: Afrique
alternative label: Afrique noire
created: 2013-07-05T11:27:24+02:00
status: 1

Afrique sub-saharienne
type: PreferredTerm
modified: 2013-07-05T00:00:00+02:00
created: 2013-07-05T11:27:24+02:00
status: 1

Afrique noire
type: SimpleNonPreferredTerm
modified: 2013-07-05T00:00:00+02:00
created: 2013-07-05T11:27:24+02:00
status: 1

ameublement
type: Concept
modified: 2020-09-01T14:37:09+02:00
in scheme: Liste d'autorités Domaines - Joconde
broader: domaine par type de fonction
alternative label: mobilier
created: 2013-07-05T11:27:24+02:00
scope note: Inclut les notions d'aménagement, accessoire d'ameublement, etc.
focus: AMEUBLEMENT
definition: Ensemble de meubles, d’objets concourant à l’aménagement, à l’ornement, à l’équipement d’une habitation, de locaux publics ou privés. (Acad. fr)
status: 1

ameublement
type: PreferredTerm
modified: 2020-09-01T14:37:09+02:00
created: 2013-07-05T11:27:24+02:00
status: 1

mobilier
type: SimpleNonPreferredTerm
modified: 2020-09-01T14:37:09+02:00
created: 2013-07-05T11:27:24+02:00
status: 1

enseignement
type: Concept
modified: 2013-07-05T00:00:00+02:00
in scheme: Liste d'autorités Domaines - Joconde
broader: domaine par type de fonction
created: 2013-07-05T11:27:24+02:00
scope note: Inclut les notions d'éducation, etc.
definition: Action de transmettre un savoir ; résultat de cette action. Organisation de l'instruction. Profession de ceux qui enseignent. (Acad.fr)
status: 1

enseignement
type: PreferredTerm
modified: 2013-07-05T00:00:00+02:00
created: 2013-07-05T11:27:24+02:00
status: 1

Asie orientale
type: Concept
modified: 2013-07-05T00:00:00+02:00
in scheme: Liste d'autorités Domaines - Joconde
broader: Asie
alternative label: Extrême-Orient
created: 2013-07-05T11:27:24+02:00
status: 1

Extrême-Orient
type: SimpleNonPreferredTerm
modified: 2013-07-05T00:00:00+02:00
created: 2013-07-05T11:27:24+02:00
status: 1

Asie orientale
type: PreferredTerm
modified: 2013-07-05T00:00:00+02:00
created: 2013-07-05T11:27:24+02:00
status: 1

marine
type: Concept
modified: 2013-07-05T00:00:00+02:00
in scheme: Liste d'autorités Domaines - Joconde
broader: transports - communications
created: 2013-07-05T11:27:24+02:00
scope note: Inclut la voilerie, les ex-voto de marins [pour ces derniers, doubler avec croyances – coutumes], les portraits de bateaux identifiés …
definition: Ce qui concerne la navigation sur mer et l'art de naviguer. (Acad. fr)
status: 1

transports - communications
type: Concept
modified: 2013-07-05T00:00:00+02:00
in scheme: Liste d'autorités Domaines - Joconde
narrower: marine
narrower: batellerie
broader: domaine par type de fonction
created: 2013-07-05T11:27:24+02:00
scope note: Inclut les notions de transport, moyens de transport, véhicule, attelage, harnachement, communication, information, instrument de communication, etc. Doubler éventuellement avec sellerie ou éperonnerie (hippiqua).
definition: Transports : déplacement de choses ou de personnes sur une assez longue distance et par des moyens spéciaux (le plus souvent par un intermédiaire), ou à des fins commerciales, économiques. Ensemble des moyens employés pour transporter les marchandises et les personnes. (Robert) Communication : Moyen de relier des personnes ou des collectivités entre elles. (Acad.fr)
status: 1

marine
type: PreferredTerm
modified: 2013-07-05T00:00:00+02:00
created: 2013-07-05T11:27:24+02:00
status: 1

ébénisterie
type: PreferredTerm
modified: 2013-07-05T00:00:00+02:00
created: 2013-07-05T11:27:24+02:00
status: 1

inuit
type: Concept
modified: 2013-07-05T00:00:00+02:00
in scheme: Liste d'autorités Domaines - Joconde
broader: civilisation
created: 2013-07-05T11:27:24+02:00
definition: Descendants directs d'un peuple de chasseurs préhistoriques qui avait occupé tout le territoire canadien depuis l'Alaska. Appelé Thulé par les archéologues, ce peuple subsistait grâce à la chasse des baleines boréales.
status: 1

inuit
type: PreferredTerm
modified: 2013-07-05T00:00:00+02:00
created: 2013-07-05T11:27:24+02:00
status: 1

oeuvre textile
type: Concept
modified: 2013-07-05T00:00:00+02:00
in scheme: Liste d'autorités Domaines - Joconde
broader: textile
created: 2013-07-05T11:27:24+02:00
scope note: Concerne l'art contemporain (après 1945).
status: 1

oeuvre textile
type: PreferredTerm
modified: 2013-07-05T00:00:00+02:00
created: 2013-07-05T11:27:24+02:00
status: 1

objet/design
type: PreferredTerm
modified: 2015-04-07T16:22:31+02:00
created: 2015-04-07T16:22:31+02:00
status: 1

industrie osseuse
type: PreferredTerm
modified: 2013-07-05T00:00:00+02:00
created: 2013-07-05T11:27:24+02:00
status: 1

temps modernes
type: PreferredTerm
modified: 2013-07-05T00:00:00+02:00
created: 2013-07-05T11:27:24+02:00
status: 1

vannerie
type: PreferredTerm
modified: 2013-07-05T00:00:00+02:00
created: 2013-07-05T11:27:24+02:00
status: 1

amérindien
type: Concept
modified: 2013-07-05T00:00:00+02:00
in scheme: Liste d'autorités Domaines - Joconde
broader: civilisation
created: 2013-07-05T11:27:24+02:00
definition: Relatif aux Indiens d'Amérique. (Acad.fr)
status: 1

amérindien
type: PreferredTerm
modified: 2013-07-05T00:00:00+02:00
created: 2013-07-05T11:27:24+02:00
status: 1

art pariétal
type: Concept
modified: 2013-07-05T00:00:00+02:00
in scheme: Liste d'autorités Domaines - Joconde
broader: domaine par support de conservation
created: 2013-07-05T11:27:24+02:00
scope note: Concerne exclusivement l'archéologie. Cf art mobilier.
definition: Ensemble des œuvres préhistoriques peintes, sculptées, gravées et plus rarement modelées, sur les parois des grottes et abris ou en plein air. L'art sur bloc est généralement classé dans l'art pariétal par la taille de ses supports ne permettant pas de le transporter. [D'après Baffier, Lantier]
status: 1

manuscrit
type: Concept
modified: 2013-07-05T00:00:00+02:00
in scheme: Liste d'autorités Domaines - Joconde
broader: domaine par support de conservation
created: 2013-07-05T11:27:24+02:00
definition: Qui est écrit à la main, par opposition à ce qui est imprimé, dactylographié, etc. Texte original ou copie d'un ouvrage écrit à la main. Se dit plus particulièrement de certains textes ou écrits remarquables par leur ancienneté, leur rareté, leur support, leur objet, etc. et qui sont généralement antérieurs à l'invention de l'imprimerie. (Acad. Fr)
status: 1

dessin
type: Concept
modified: 2013-07-05T00:00:00+02:00
in scheme: Liste d'autorités Domaines - Joconde
broader: domaine par support de conservation
created: 2013-07-05T11:27:24+02:00
scope note: Inclut : aquarelle, gouache, pastel. Exclut la peinture à l'huile. Attention, les œuvres extrême-orientales (Chine, Japon…) à l'encre ou aux couleurs légères sur papier relèvent du domaine de la peinture.
definition: Œuvre unique, monochrome ou colorée, sur papier.
status: 1

domaine par support de conservation
type: PreferredTerm
modified: 2013-07-05T00:00:00+02:00
created: 2013-07-05T11:27:24+02:00
status: 1

agriculture - élevage
type: Concept
modified: 2013-07-05T00:00:00+02:00
in scheme: Liste d'autorités Domaines - Joconde
broader: domaine par type de fonction
created: 2013-07-05T11:27:24+02:00
definition: Agriculture : Activité ayant pour objet l'exploitation de la terre par la production de végétaux et l'élevage des animaux. Par métonymie : l'ensemble des agriculteurs et des exploitations agricoles. (Acad.fr) Elevage : Action d'élever des animaux domestiques ou utiles à l'homme ; résultat de cette action. Le fait d'élever du bétail en vue de la production de viande et de produits laitiers. Par extension, Entreprise dont l'activité consiste à élever une catégorie d'animaux ; lieu où ces animaux sont élevés. (Acad.fr)
status: 1

agriculture - élevage
type: PreferredTerm
modified: 2013-07-05T00:00:00+02:00
created: 2013-07-05T11:27:24+02:00
status: 1

céramique
type: PreferredTerm
modified: 2013-07-05T00:00:00+02:00
created: 2013-07-05T11:27:24+02:00
status: 1

géographie
type: PreferredTerm
modified: 2019-02-07T15:50:08+01:00
created: 2013-07-05T11:27:24+02:00
status: 1

Océanie
type: Concept
modified: 2013-07-05T00:00:00+02:00
in scheme: Liste d'autorités Domaines - Joconde
broader: géographie
created: 2013-07-05T11:27:24+02:00
status: 1

italique
type: Concept
modified: 2013-07-05T00:00:00+02:00
in scheme: Liste d'autorités Domaines - Joconde
broader: civilisation
created: 2013-07-05T11:27:24+02:00
definition: Relatif aux populations de l'Italie antique, et plus particulièrement à leurs langues. (Acad.fr)
status: 1

italique
type: PreferredTerm
modified: 2013-07-05T00:00:00+02:00
created: 2013-07-05T11:27:24+02:00
status: 1

mésolithique
type: PreferredTerm
modified: 2013-07-05T00:00:00+02:00
created: 2013-07-05T11:27:24+02:00
status: 1

batellerie
type: Concept
modified: 2013-07-05T00:00:00+02:00
in scheme: Liste d'autorités Domaines - Joconde
broader: transports - communications
created: 2013-07-05T11:27:24+02:00
definition: Industrie des transports fluviaux, ensemble des bateaux assurant ces transports (Acad. fr).
status: 1

batellerie
type: PreferredTerm
modified: 2013-07-05T00:00:00+02:00
created: 2013-07-05T11:27:24+02:00
status: 1

Asie
type: PreferredTerm
modified: 2013-07-05T00:00:00+02:00
created: 2013-07-05T11:27:24+02:00
status: 1

Asie centrale
type: Concept
modified: 2013-07-05T00:00:00+02:00
in scheme: Liste d'autorités Domaines - Joconde
broader: Asie
created: 2013-07-05T11:27:24+02:00
status: 1

ivoirerie
type: PreferredTerm
modified: 2013-07-05T00:00:00+02:00
created: 2013-07-05T11:27:24+02:00
status: 1

civilisations de l'Islam
type: Concept
modified: 2019-10-25T11:21:56+02:00
in scheme: Liste d'autorités Domaines - Joconde
broader: civilisation
alternative label: islam
alternative label: Civilisations de l'Islam
created: 2013-07-05T11:27:24+02:00
definition: L'expression arts de l'Islam ou art islamique désigne la production artistique qui s'est développée depuis l'hégire (622 de l'ère chrétienne) jusqu'au XIXe siècle dans un territoire s'étendant de l'Espagne jusqu'à l'Inde et habité par des populations de culture islamique.
status: 1

civilisations de l'Islam
type: PreferredTerm
modified: 2019-10-25T11:21:56+02:00
created: 2017-12-08T08:19:05+01:00
status: 1

islam
type: SimpleNonPreferredTerm
modified: 2019-10-25T11:21:56+02:00
created: 2013-07-05T11:27:24+02:00
status: 1

dentellerie
type: Concept
modified: 2013-07-05T00:00:00+02:00
in scheme: Liste d'autorités Domaines - Joconde
broader: textile
created: 2013-07-05T11:27:24+02:00
definition: Fabrication, commerce de la dentelle (tissu à jour et à mailles très fines, constitué par entrelacement de fils et orné de motifs décoratifs. (Acad. fr) Par extension, objets ainsi fabriqués.
status: 1

dentellerie
type: PreferredTerm
modified: 2013-07-05T00:00:00+02:00
created: 2013-07-05T11:27:24+02:00
status: 1

paléolithique
type: PreferredTerm
modified: 2013-07-05T00:00:00+02:00
created: 2013-07-05T11:27:24+02:00
status: 1

dessin
type: PreferredTerm
modified: 2013-07-05T00:00:00+02:00
created: 2013-07-05T11:27:24+02:00
status: 1

numismatique
type: PreferredTerm
modified: 2013-07-05T00:00:00+02:00
created: 2013-07-05T11:27:24+02:00
status: 1

chasse - pêche - cueillette
type: Concept
modified: 2013-07-05T00:00:00+02:00
in scheme: Liste d'autorités Domaines - Joconde
broader: domaine par type de fonction
created: 2013-07-05T11:27:24+02:00
scope note: Inclut les notions d'armes et d'objets se rapportant à ce domaine.
definition: Chasse : Action de rechercher le gibier pour le capturer ou le tuer. (Acad.fr) Pêche : action ou manière de prendre les poissons (Robert) Cueillette : Action de cueillir les fruits, les fleurs de certains arbres, de certaines plantes ; résultat de cette action. En ethnologie : mode de subsistance des groupes humains vivant de la collecte et du ramassage des produits naturels. (Acad.fr)
status: 1

chasse - pêche - cueillette
type: PreferredTerm
modified: 2013-07-05T00:00:00+02:00
created: 2013-07-05T11:27:24+02:00
status: 1

manuscrit
type: PreferredTerm
modified: 2013-07-05T00:00:00+02:00
created: 2013-07-05T11:27:24+02:00
status: 1

mérovingien
type: Concept
modified: 2013-07-05T00:00:00+02:00
in scheme: Liste d'autorités Domaines - Joconde
broader: civilisation
created: 2013-07-05T11:27:24+02:00
definition: Dynastie qui régna sur les Francs Saliens, puis sur la Gaule à partir de Clovis (481-511) ; elle fut évincée par les Carolingiens en 751. (Larousse)
status: 1

civilisation
type: PreferredTerm
modified: 2019-02-07T15:47:52+01:00
created: 2013-07-05T11:27:24+02:00
status: 1

textile
type: PreferredTerm
modified: 2013-07-05T00:00:00+02:00
created: 2013-07-05T11:27:24+02:00
status: 1

broderie
type: Concept
modified: 2013-07-05T00:00:00+02:00
in scheme: Liste d'autorités Domaines - Joconde
broader: textile
created: 2013-07-05T11:27:24+02:00
definition: Industrie ou commerce des tissus brodés (ouvrages exécutés à l'aiguille ou à la machine, sur une étoffe ou un canevas, de dessins et de motifs ornementaux). (Acad. fr) Par extension, objets ainsi fabriqués.
status: 1

flore
type: SimpleNonPreferredTerm
modified: 2013-07-05T00:00:00+02:00
created: 2013-07-05T11:27:24+02:00
status: 1

botanique
type: PreferredTerm
modified: 2013-07-05T00:00:00+02:00
created: 2013-07-05T11:27:24+02:00
status: 1

vie militaire
type: Concept
modified: 2013-07-05T00:00:00+02:00
in scheme: Liste d'autorités Domaines - Joconde
broader: domaine par type de fonction
alternative label: militaria
created: 2013-07-05T11:27:24+02:00
scope note: Inclut les notions d'armement, armes, armes d'apparat dans un contexte militaire, accessoires d'arme , etc. A l'exclusion des armes de chasse que l'on rangera sous chasse – pêche – cueillette. Pour les uniformes militaires, doubler avec costume - accessoires du costume
definition: Relatif à la force armée, à son organisation, à ses activités, en particulier au cours d'un conflit. (Robert)
status: 1

artisanat - industrie
type: Concept
modified: 2013-07-05T00:00:00+02:00
in scheme: Liste d'autorités Domaines - Joconde
broader: domaine par type de fonction
created: 2013-07-05T11:27:24+02:00
scope note: Inclut les notions d'outillage, outils, etc. Nb : activités et techniques de transformation sur commande et/ou pour la vente, par opposition aux activités domestiques, voir vie domestique.
definition: Artisanat : Condition ou métier d'artisan (personne installée à son compte pour exercer un métier manuel) ; ensemble des artisans ; mode de production des artisans ou, par métonymie, ensemble des objets et denrées qu'ils produisent. (Acad.fr) Industrie : S'est dit de toute sorte d'activité concourant à la production et à la circulation des richesses. Désigne aujourd'hui l'ensemble des activités ayant pour objet l'exploitation des richesses minières et des sources d'énergie, la transformation des matières premières en produits fabriqués ainsi que chacune des branches de ce secteur économique. Par analogie, se dit d'autres secteurs d'activité producteurs de richesses par la vente de services, considérés dans leur organisation d'ensemble. (Acad.fr)
status: 1

construction
type: Concept
modified: 2013-07-05T00:00:00+02:00
in scheme: Liste d'autorités Domaines - Joconde
broader: domaine par type de fonction
created: 2013-07-05T11:27:24+02:00
scope note: Exemples : échafaudage, canalisation, pavement ...
definition: Le fait de bâtir, d'élever un édifice, de construire un ouvrage d'art. Par extension, l'ensemble des entreprises qui consacrent leur activité à ce type de productions. (Acad.fr)
status: 1

domaine par type de fonction
type: PreferredTerm
modified: 2013-07-05T00:00:00+02:00
created: 2013-07-05T11:27:24+02:00
status: 1

Afrique
type: PreferredTerm
modified: 2013-07-05T00:00:00+02:00
created: 2013-07-05T11:27:24+02:00
status: 1

chaudronnerie
type: PreferredTerm
modified: 2013-07-05T00:00:00+02:00
created: 2013-07-05T11:27:24+02:00
status: 1

construction
type: PreferredTerm
modified: 2013-07-05T00:00:00+02:00
created: 2013-07-05T11:27:24+02:00
status: 1

vie militaire
type: PreferredTerm
modified: 2013-07-05T00:00:00+02:00
created: 2013-07-05T11:27:24+02:00
status: 1

militaria
type: SimpleNonPreferredTerm
modified: 2013-07-05T00:00:00+02:00
created: 2013-07-05T11:27:24+02:00
status: 1

arts décoratifs
type: PreferredTerm
modified: 2013-07-05T00:00:00+02:00
created: 2013-07-05T11:27:24+02:00
status: 1

Asie centrale
type: PreferredTerm
modified: 2013-07-05T00:00:00+02:00
created: 2013-07-05T11:27:24+02:00
status: 1

moderne
type: PreferredTerm
modified: 2013-07-05T00:00:00+02:00
created: 2013-07-05T11:27:24+02:00
status: 1

mérovingien
type: PreferredTerm
modified: 2018-12-21T11:21:20+01:00
created: 2013-07-05T11:27:24+02:00
status: 1

Océanie
type: PreferredTerm
modified: 2013-07-05T00:00:00+02:00
created: 2013-07-05T11:27:24+02:00
status: 1

transports - communications
type: PreferredTerm
modified: 2013-07-05T00:00:00+02:00
created: 2013-07-05T11:27:24+02:00
status: 1

menuiserie
type: PreferredTerm
modified: 2013-07-05T00:00:00+02:00
created: 2013-07-05T11:27:24+02:00
status: 1

beaux-arts
type: PreferredTerm
modified: 2013-07-05T00:00:00+02:00
created: 2013-07-05T11:27:24+02:00
status: 1

mémoire de l'esclavage
type: Concept
modified: 2017-03-16T09:43:34+01:00
in scheme: Liste d'autorités Domaines - Joconde
broader: histoire
alternative label: esclavage
created: 2016-09-01T15:06:05+02:00
definition: Mémoire de l'esclavage : signale les œuvres ou objets inventoriés dans les collections des musées de France relatifs à l'histoire et à la mémoire de la traite, de l’esclavage et de leur abolition. (décret n°2009-506 du 6 mai 2009 relatif au Comité pour la mémoire et l'histoire de l'esclavage) ; Période : du XVe siècle à la période contemporaine
status: 1

mémoire de l'esclavage
type: PreferredTerm
modified: 2019-02-08T12:28:39+01:00
created: 2017-03-16T09:43:05+01:00
status: 1

esclavage
type: SimpleNonPreferredTerm
modified: 2017-03-16T09:43:34+01:00
created: 2016-09-01T15:06:05+02:00
status: 1

néolithique
type: PreferredTerm
modified: 2013-07-05T00:00:00+02:00
created: 2013-07-05T11:27:24+02:00
status: 1

précolombien
type: PreferredTerm
modified: 2013-07-05T00:00:00+02:00
created: 2013-07-05T11:27:24+02:00
status: 1

broderie
type: PreferredTerm
modified: 2013-07-05T00:00:00+02:00
created: 2013-07-05T11:27:24+02:00
status: 1

artisanat - industrie
type: PreferredTerm
modified: 2013-07-05T00:00:00+02:00
created: 2013-07-05T11:27:24+02:00
status: 1

histoire
type: PreferredTerm
modified: 2013-07-05T00:00:00+02:00
created: 2013-07-05T11:27:24+02:00
status: 1

art pariétal
type: PreferredTerm
modified: 2013-07-05T00:00:00+02:00
created: 2013-07-05T11:27:24+02:00
status: 1

domaine par chronologie/civilisation/géographie
type: Concept
modified: 2019-02-07T15:46:51+01:00
in scheme: Liste d'autorités Domaines - Joconde
narrower: civilisation
narrower: géographie
narrower: chronologie
created: 2019-02-07T15:46:51+01:00
status: 1

accessoires du costume civil
type: Concept
modified: 2019-02-21T16:47:54+01:00
in scheme: Liste d'autorités Domaines - Joconde
broader: costume - accessoires du costume
created: 2019-02-21T16:47:54+01:00
scope note: Pour les musées avec des collections de vie militaire : Inclut les notions d’habillement autres que les habits militaires : sous-vêtements, vêtements, accessoires du costume comme les cravates, les ceintures (autre que équipement militaire), accessoires du costume de représentation, chaussures, couvre-chefs, bijoux, objets de parure, gants, sac, etc… Source : ministère des Armées, Direction des patrimoines, de la mémoire et des archives.
status: 1

accessoires du costume civil
type: PreferredTerm
modified: 2019-02-21T16:47:54+01:00
created: 2019-02-21T16:47:54+01:00
status: 1

Amérique du Sud
type: SimpleNonPreferredTerm
modified: 2019-11-21T14:29:29+01:00
created: 2019-10-25T09:13:36+02:00
status: 1

Asie du Sud-Est
type: SimpleNonPreferredTerm
modified: 2019-11-21T14:28:55+01:00
created: 2019-10-25T09:29:21+02:00
status: 1

Amérique du Nord
type: SimpleNonPreferredTerm
modified: 2019-11-21T14:29:12+01:00
created: 2019-10-25T09:17:36+02:00
status: 1

Afrique du Nord
type: SimpleNonPreferredTerm
modified: 2019-11-21T14:30:17+01:00
created: 2019-10-25T09:19:14+02:00
status: 1

moyen âge
type: SimpleNonPreferredTerm
modified: 2019-10-25T11:20:53+02:00
created: 2019-10-25T11:20:53+02:00
status: 1

moyen-âge
type: SimpleNonPreferredTerm
modified: 2019-10-25T11:20:53+02:00
created: 2019-10-25T11:20:53+02:00
status: 1

Moyen Age
type: SimpleNonPreferredTerm
modified: 2019-10-25T11:20:53+02:00
created: 2019-10-25T11:20:53+02:00
status: 1

Civilisations de l'Islam
type: SimpleNonPreferredTerm
modified: 2019-10-25T11:21:56+02:00
created: 2019-10-25T11:21:56+02:00
status: 1

migrations humaines
type: Concept
modified: 2019-12-09T10:02:47+01:00
in scheme: Liste d'autorités Domaines - Joconde
broader: histoire
created: 2019-12-09T10:02:47+01:00
definition: Ce terme concerne tous les items relatifs aux migrations internationales (immigration et émigration) mais aussi aux déplacements durables à l’intérieur d’un même espace national (ex. exode rural au 19e siècle, migrations des français d’outremer vers la métropole). Il n’y a pas de bornes géographiques ni chronologiques. Les déplacements de courte durée (voyages, tourisme), ne sont pas concernés. Source : Musée national de l'histoire et des cultures de l'immigration.
status: 1

migrations humaines
type: PreferredTerm
modified: 2019-12-09T10:02:47+01:00
created: 2019-12-09T10:02:47+01:00
status: 1

vexillologie
type: Concept
modified: 2020-04-29T12:12:32+02:00
in scheme: Liste d'autorités Domaines - Joconde
broader: domaine disciplinaire
created: 2020-04-29T12:12:32+02:00
definition: ​Du latin "vexillum", étendard des armées romaines. Etude des pavillons, étendards et drapeaux.
status: 1

vexillologie
type: PreferredTerm
modified: 2020-04-29T12:12:32+02:00
created: 2020-04-29T12:12:32+02:00
status: 1