praticien
created: 2018-08-27T14:55:46+02:00
modified: 2019-06-03T16:14:49+02:00
status: 1
type: Concept
broader: T523-2383
definition: Au sens général : s'étend à tous ceux qui pratiquent la médecine professionnellement.
example: chirurgien, dentiste, médecin, pharmacien, etc.
in scheme: T523
notation: 03.02.03.03
scope note: A combiner éventuellement avec un spécifique de thérapeutique.