prothèse
created: 2018-08-27T14:55:46+02:00
modified: 2019-06-03T16:19:27+02:00
status: 1
type: Concept
broader: T523-2435
in scheme: T523
notation: 03.02.05.06.05
scope note: A combiner éventuellement avec une partie du corps ou un élément interne du corps.