verre à pied
created: 2018-08-27T14:55:46+02:00
modified: 2019-06-12T16:18:28+02:00
status: 1
type: Concept
broader: T523-2579
definition: Récipient à boire, avec un pied, quel que soit son matériau.
in scheme: T523
notation: 03.04.06.02.02.15.01
scope note: Ne pas confondre avec coupe, récolte des plantes.