coiffe
created: 2018-08-27T14:55:46+02:00
modified: 2019-06-03T12:19:50+02:00
status: 1
type: Concept
broader: T523-2649
definition: Ajustement d'étoffe destiné à couvrir et à orner la tête des femmes ou des jeunes filles, et variant suivant les provinces. Se dit également de la coiffure traditionnelle de divers ordres et congrégations de religieuses.
example: mantille, fichu, foulard, mouchoir, etc. et toute coiffe régionale.
in scheme: T523
notation: 03.06.01.20.08