palais
created: 2018-08-27T14:55:46+02:00
modified: 2019-06-03T15:26:29+02:00
status: 1
type: Concept
broader: T523-2734
definition: Résidence somptueuse située dans un ville.
in scheme: T523
notation: 03.07.02.01.10