appareil
created: 2018-08-27T14:55:46+02:00
modified: 2019-04-12T16:44:35+02:00
status: 1
type: Concept
broader: T523-2896
definition: Dispositif actionné à la main ou par une autre source d'énergie pour remplir une fonction spécifique.
in scheme: T523
notation: 03.16.01.01
scope note: Ne pas confondre avec machine, réservé à un contexte industriel.