bâton
created: 2018-08-27T14:55:46+02:00
modified: 2019-06-03T11:13:16+02:00
status: 1
type: Concept
broader: T523-2896
in scheme: T523
notation: 03.16.01.03
scope note: Peut être utilisé comme signe du pouvoir, comme moyen de transport, voire comme arme. Ne pas confondre avec canne, instrument de traitement et crosse, objet du culte.