filet
created: 2018-08-27T14:55:46+02:00
modified: 2019-04-11T11:42:30+02:00
status: 1
type: Concept
alternative label: nasse
broader: T523-2974
definition: Réseau à larges mailles servant généralement à capturer des animaux.
in scheme: T523
notation: 03.16.03.23