cure
created: 2018-08-27T14:55:46+02:00
modified: 2019-04-15T12:29:56+02:00
status: 1
type: Concept
broader: T523-2426
in scheme: T523
notation: 03.02.05.05.02.01
scope note: Au sens large : cure médicale, cure thermale, régime, etc.