sur partie rapportée
created: 2013-05-24T14:10:14+02:00
modified: 2016-06-06T16:02:01+02:00
status: 1
type: Concept
broader: T529-295
in scheme: T529
narrower: T529-298
narrower: T529-299
narrower: T529-300
scope note: Que cette partie soit un remploi ou non, par exemple des médaillons fondus signés sur un ciboire ou des plaques de porcelaine sur une table.