croquis
created: 2013-07-16T11:33:39+02:00
modified: 2016-03-22T16:58:46+01:00
status: 1
type: Concept
definition: Dessin rapide et sommaire exécuté à main levée. Le croquis n'est pas forcément une œuvre préparatoire.
in scheme: T532