oeuvre pour le report
created: 2013-07-16T11:33:39+02:00
modified: 2016-03-22T17:53:27+01:00
status: 1
type: Concept
alternative label: œuvre pour le report
broader: T532-5
definition: ​Œuvre servant à reporter sur un autre support une composition ou une partie de composition, à grandeur ou à une échelle différente.
in scheme: T532
narrower: T532-14
narrower: T532-19
narrower: T532-20
narrower: T532-21
narrower: T532-22