carton
created: 2013-07-16T11:33:39+02:00
modified: 2016-03-22T18:09:11+01:00
status: 1
type: Concept
broader: T532-13
definition: Modèle à grandeur d'exécution, destiné à être reporté sur un autre support ou à être transposé dans une autre technique. Les cartons peuvent être faits sur des matériaux divers : carton, papier, bois, toile, zinc, etc.
in scheme: T532
narrower: T532-15
narrower: T532-17