poncis
created: 2013-07-16T11:33:39+02:00
modified: 2016-03-22T18:17:48+01:00
status: 1
type: Concept
alternative label: dessin piqué pour le report
broad match: http://data.bnf.fr/ark:/12148/cb169374824
broad match: Carton (art)
broader: T532-14
definition: Œuvre servant de carton, percée de petits trous, soit à la molette à poncis, soit à l'aiguille, généralement en suivant les traits d'une composition ou les lignes d'un motif.
in scheme: T532
preferred label: pricked drawing @en