oeuvre incisée pour le report
created: 2013-07-16T11:33:39+02:00
modified: 2016-03-22T18:24:32+01:00
status: 1
type: Concept
alternative label: dessin incisé pour le report
alternative label: œuvre incisée pour le report
broad match: http://data.bnf.fr/ark:/12148/cb169374824
broad match: Carton (art)
broader: T532-14
definition: Œuvre servant de carton que l'on incise avec une lame ou une pointe pour en reporter trait pour trait tout ou partie de la composition et éventuellement les contours.
in scheme: T532