étude
created: 2013-07-16T11:33:39+02:00
modified: 2016-03-23T12:17:10+01:00
status: 1
type: Concept
definition: Œuvre dont le but est de mettre au point la représentation d'un élément particulièrement difficile.
in scheme: T532
preferred label: study @en