pochade
created: 2013-07-16T11:33:39+02:00
modified: 2016-03-23T13:15:23+01:00
status: 1
type: Concept
definition: Peinture ou dessin de petit format exécuté de chic, rapidement, avec une grande liberté de facture, mais qui est une œuvre achevée à la différence de l'esquisse ou du croquis.
in scheme: T532