oeuvre composite
created: 2013-07-16T11:33:39+02:00
modified: 2016-03-23T15:55:04+01:00
status: 1
type: Concept
alternative label: œuvre composite
broader: T532-40
definition: Œuvre composée, totalement ou partiellement, d'éléments copiés dans l'œuvre d'un autre auteur.
in scheme: T532