avec oeuvre apparentée connue
created: 2013-07-16T11:33:39+02:00
modified: 2016-03-23T17:02:00+01:00
status: 1
type: Concept
alternative label: avec œuvre apparentée connue
in scheme: T532
scope note: Est considérée comme apparentée toute œuvre correspondant à l'une des étapes de la création de l'œuvre analysée (esquisse, modèle, etc.).