maquette
created: 2013-07-16T11:33:39+02:00
modified: 2016-03-23T17:44:41+01:00
status: 1
type: Concept
broader: T532-69
definition: Reproduction en volume, à échelle réduite, fidèle dans ses proportions et son aspect mais qui, pour les machines, ne peut pas fonctionner.
in scheme: T532