prototype
created: 2013-07-16T11:33:39+02:00
modified: 2016-03-23T17:49:19+01:00
status: 1
type: Concept
broader: T532-69
definition: Pour les machines et le patrimoine maritime et fluvial, premier exemplaire, modèle original à reproduire.
in scheme: T532