modèle réduit
terme associe: T532-10
created: 2013-07-16T11:33:39+02:00
modified: 2016-03-22T17:36:44+01:00
status: 1
type: Concept
broader: T532-5
definition: Reproduction en volume, à échelle réduite, fidèle dans ses proportions et son aspect, capable de fonctionner, au moins partiellement.
in scheme: T532
preferred label: scale model @en
related: T532-10