contretype positif
created: 2009-01-01T00:00:00+01:00
modified: 2009-01-01T00:00:00+01:00
status: 1
type: Concept
alternative label: duplicata de positif transparent couleur
broader: T61-022
definition: Duplicata de positif transparent couleur.
in scheme: T61
notation: ICP