voûte d'arêtes
created: 2013-05-21T17:38:41+02:00
modified: 2016-03-29T17:20:03+02:00
status: 1
type: Concept
broader: T66-9
definition: Voûte constituée de quartiers dont les rencontres forment des arêtes saillantes se recoupant à un faîte commun : la voûte d'arêtes est donc théoriquement le résultat de la pénétration de plusieurs berceaux de même hauteur dont les lignes de faîte restent entières. Elle comprend habituellement quatre quartiers.
in scheme: T66
narrower: T66-12
narrower: T66-13
preferred label: groined vault @en