voûte à arêtes doubles
created: 2013-05-21T17:38:41+02:00
modified: 2016-03-29T17:31:11+02:00
status: 1
type: Concept
broad match: http://data.bnf.fr/ark:/12148/cb167689105
broad match: Voûte d'arêtes
broad match: http://vocab.getty.edu/aat/300001347
broader: T66-11
definition: Voûte constituée de lunettes séparées les unes des autres par des voûtains triangulaires qui forment avec elles des arêtes doubles convergeant vers les points d'appui. La voûte à arêtes doubles peut donc être considérée comme un cas particulier de voûte d'arêtes dont les berceaux ne se pénétreraient pas. Les arêtes doubles dessinent une étoile autour de la clef de voûte.
in scheme: T66