voûte d'ogives
created: 2013-05-21T17:38:41+02:00
modified: 2016-03-30T12:40:53+02:00
status: 1
type: Concept
broader: T66-9
definition: Voûte construite sur le plan d'une voûte d'arêtes, mais sans arête, la rencontre des quartiers étant formée par des branches d'ogive. La voûte d'ogives a généralement quatre quartiers.
in scheme: T66
narrower: T66-15
preferred label: ogival vault @en