voûte d'ogives bombée
created: 2013-05-21T17:38:41+02:00
modified: 2016-03-30T12:46:27+02:00
status: 1
type: Concept
broad match: http://data.bnf.fr/ark:/12148/cb133315699
broad match: Voûte d'ogive
broader: T66-14
definition: Voûte d'ogives à quartiers inclinés, leur ligne de faîte montant vers la clef de voûte.
in scheme: T66